{"text_format":"1","workbook":"xlsx","n_sheets":11,"sheets":["Cálc. Sist. Extinção Automática","Curvas da Instalação","Quadro 1","Quadro 2","Quadros 3 a 5-RTSCIE","Quadros 3 a 5-EN 12845","Quadros 3 a 6-NFPA 13","Gráficos 1 e 2-NFPA 13","Instruções","Procedimento","Conversões"],"not_rendered":{"charts":3,"images":91,"macros":1,"external_links":0,"defined_names":10,"comments":4,"pivot_tables":0},"unopened":[],"bounds":{"document_bytes":16777216,"sheet_cells":100000,"rows_first":2000,"rows_last":500,"rows_between":2000,"halvings":0,"cell_chars":16384,"cell_head_chars":4096},"cells_cut":0,"cells_raw":0,"read":"whole","date_system":"1900"}

{"sheet":"Cálc. Sist. Extinção Automática","index":0,"n_rows":195,"n_cols":259,"rows_kept":195,"cut":false,"hidden":false,"merged":[[20,28,20,29],[18,26,18,27],[20,4,20,6],[21,4,21,6],[19,5,19,6],[18,5,18,6],[50,8,50,20],[20,26,20,27],[20,20,20,25],[22,26,22,27],[21,26,21,27],[20,16,20,17],[20,7,20,8],[20,9,20,12],[9,4,9,5],[10,4,10,5],[7,16,7,22],[8,16,8,22],[1,40,1,42],[1,22,1,26],[5,35,5,36],[1,29,1,36],[4,4,4,5],[5,4,5,5],[6,4,6,5],[8,4,8,5],[6,35,6,36],[7,35,7,36],[7,4,7,5],[11,37,11,43],[17,35,17,36],[15,35,15,36],[11,35,11,36],[23,40,23,42],[20,30,20,38],[22,35,22,37],[20,39,20,42],[21,40,21,42],[21,35,21,38],[18,40,18,42],[19,40,19,42],[19,35,19,38],[18,35,18,38],[45,40,45,42],[46,40,46,42],[43,40,43,42],[33,40,33,42],[34,40,34,42],[35,40,35,42],[36,40,36,42],[39,40,39,42],[41,40,41,42],[37,40,37,42],[38,40,38,42],[40,40,40,42],[30,40,30,42],[26,40,26,42],[24,40,24,42],[44,40,44,42],[32,40,32,42],[31,40,31,42],[27,40,27,42],[28,40,28,42],[48,40,48,42],[25,40,25,42],[30,35,30,38],[25,35,25,38],[42,40,42,42],[47,40,47,42],[35,35,35,38],[36,35,36,38],[43,35,43,38],[33,35,33,38],[34,35,34,38],[39,35,39,38],[37,35,37,38],[46,35,46,38],[47,35,47,38],[29,40,29,42],[24,35,24,38],[23,35,23,38],[48,35,48,38],[32,35,32,38],[38,35,38,38],[42,35,42,38],[40,35,40,38],[41,35,41,38],[44,35,44,38],[45,35,45,38],[31,35,31,38],[29,35,29,38],[26,35,26,38],[27,35,27,38],[28,35,28,38]]}
[]
[null,null,null,null,null,null,null,null,null,null,null,null,null,null,null,null,null,null,null,null,"Ref.ª",null,null,null,null,null,null,null,"Descrição:",null,null,null,null,null,null,null,null,null,null,"Data:",null,null,null,null,null,null,null,"Controlo do arranjo dos sprinklers"]
[]
[null,null,null,null,"Características e Especificações:",null,null,null,null,null,null,null,"Decisões",null,null,"Adoptado"," Observações",null,null,null,null,null,null,null,null,null,null," Especificações calculadas",null,null,null,null,null,null,null,null,null," Tubagem de aspiração",null,null,null,null,null,null,null,null,{"$f":"IF($A$5=8,12,IF($A$5=9,18,IF($A$5=10,29,IF(AND(P6<>\"\",P7<>\"\"),ROUND(P6/P7,0),\"\"))))","v":12},{"$f":"IF(P8=\"\",\"\",P8)","v":12},{"$f":"IF(OR(AV4=\"\",AU7=\"\"),\"\",AV4/AU7)","v":3},{"$f":"IF(AW4=\"\",\"\",INT(AW4))","v":3},{"$f":"IF(OR(AU7=\"\",AV4=\"\",AX4=\"\"),\"\",IF(AU7*AX4=AV4,AV4,IF(AU7*AX4<AV4,AU7*(AX4+1),AU7*AX4)))","v":12},null,null,null,{"$f":"A17","v":1},"Conversão de caudal",null,null,{"$f":"IF($BC$4=2,\"l/s\",IF($BC$4=3,\"l/h\",IF($BC$4=4,\"m³/h\",\"l/min\")))","v":"l/min"},"Arred.",null,{"$f":"A18","v":1},"Conversão de pressão",{"$f":"IF($BJ$4=2,\"bar\",IF($BJ$4=3,\"m.c.a.\",IF($BJ$4=4,\"kgf/cm²\",\"kPa\")))","v":"kPa"},"Arred."]
[{"$f":"IF(B5=1,8,IF(OR(B5=2,B5=3,B5=4,B5=5),9,IF(B5=6,10,IF(B5=21,7,IF(AND(B5>=7,B5<=14),B5+4,B5-14)))))","v":8},1,null,null,null,null,null,null,null,"Classe e Grupo de Risco/Utilização Tipo :",null,null,null,null,null,{"$f":"IF($A$5=\"\",\"\",IF(OR($A$5=1,$A$5=2,$A$5=3,$A$5=4,$A$5=5,$A$5=6),\" Dimensionamento em conformidade com NFPA 13\",IF(OR($A$5=8,$A$5=9,$A$5=10),\" Dimensionamento em conformidade com RTSCIE\",IF(OR($A$5=11,$A$5=12,$A$5=13,$A$5=14,$A$5=15,$A$5=16,$A$5=17,$A$5=18),\" Dimensionamento em conformidade com EN 12845\",IF($A$5=7,\" Outra Classe de Riscos\",\"\")))))","v":" Dimensionamento em conformidade com RTSCIE"},null,null,null,null,null,null,null,null,null,null,null,null,null,null,null,null,"Afastamento máx. entre sub-ramais com sprinklers :","D =",{"$f":"IF(AU5=\"\",\"? m\",ROUND(AU5,2)&\" m\")","v":"3,45 m"},null,null,null,null,"Diâmetro interior :",null,"Di-asp.=",{"$f":"IF(AX5=\"\",\"? m\",ROUND(AX5,1)&\" mm\")","v":"? m"},null,null,"m",{"$f":"IF(OR(P7=\"\",P9=\"\"),\"\",IF($A$5=11,FLOOR(P7/P9,0.1),FLOOR(P7/P9,0.05)))","v":3.45},null,"mm",{"$f":"IF(OR(MAX(W25:W49)=\"\",MAX(W25:W49)=0),\"\",IF(AK5=\"\",MAX(MAX(W25:W49),BJ12),IF(AND(OR(AK5=\"x\",AK5<>\"\"),MAX(W25:W49)=27.3),36,IF(AND(OR(AK5=\"x\",AK5<>\"\"),MAX(W25:W49)=36),41.9,IF(AND(OR(AK5=\"x\",AK5<>\"\"),MAX(W25:W49)=41.9),53.1,IF(AND(OR(AK5=\"x\",AK5<>\"\"),MAX(W25:W49)=53.1),68.9,IF(AND(OR(AK5=\"x\",AK5<>\"\"),MAX(W25:W49)=68.9),80.9,IF(AND(OR(AK5=\"x\",AK5<>\"\"),MAX(W25:W49)=80.9),105.3,IF(AND(OR(AK5=\"x\",AK5<>\"\"),MAX(W25:W49)=105.3),129.7,IF(AND(OR(AK5=\"x\",AK5<>\"\"),MAX(W25:W49)=129.7),155.1,IF(AND(OR(AK5=\"x\",AK5<>\"\"),MAX(W25:W49)=155.1),206.5,IF(AND(OR(AK5=\"x\",AK5<>\"\"),MAX(W25:W49)=206.5),260.4,IF(AND(OR(AK5=\"x\",AK5<>\"\"),MAX(W25:W49)=260.4),311.3,311.3)))))))))))))","v":""},{"$f":"IF(AX5=\"\",\"\",LOOKUP(AX5,'Quadro 1'!$G$9:$G$23,'Quadro 1'!$E$9:$E$23))","v":""},{"$f":"IF(OR(AX5=\"\",AU15=\"\"),\"\",(66.7*AU15/$B$17)/(PI()*AX5^2))","v":""},{"$f":"IF(OR(AX5=\"\",MIN(R25:R49)=0),\"\",(66.7*MIN(R25:R49)/$B$17)/(PI()*AX5^2))","v":""},"Velocidade na tubagem de aspiração (m/s)",1,"l/min",null,null,null,{"$f":"IF(BC4=2,2,IF(BC4=3,0,IF(BC4=4,1,1)))","v":1},null,1,"kPa",null,{"$f":"IF(OR(BJ4=2,BJ4=3,BJ4=4),2,1)","v":1}]
[null,{"$f":"IF(OR($A$5=8,$A$5=13),144,IF(OR($A$5=9,$A$5=14),216,IF(OR($A$5=10,$A$5=16,$A$5=17,$A$5=18),260,IF($A$5=11,84,IF($A$5=12,72,IF($A$5=15,360,\"\"))))))","v":144},null,null,null,null,null,null,null,"Área de operação :","Ao"," m2",null,null,null,{"$f":"IF(M6<>\"\",M6,IF($A$5=1,139,IF($A$5=2,139,IF($A$5=3,279,IF($A$5=4,372,IF($A$5=5,372,IF($A$5=6,465,IF($A$5=7,\"\",B6))))))))","v":144},{"$f":"IF(AND($A$5=1,P6<>139),\"Atenção: Área de operação fora de especificação\",IF(AND(OR($A$5=2,$A$5=3,$A$5=4),AND(P6<>139,P6<>279,P6<>372)),\"Atenção: Área de operação fora de especificação\",IF(AND(OR($A$5=5,$A$5=6),AND(P6<>372,P6<>465)),\"Atenção: Área de operação fora de especificação\",IF($A$5=7,\"Função da Classe de Risco\",IF(AND($A$5=8,P6<>144),\"Atenção: Área de operação fora de especificação\",IF(AND($A$5=9,P6<>216),\"Atenção: Área de operação fora de especificação\",IF(AND($A$5=10,P6<>260),\"Atenção: Área de operação fora de especificação\",IF(AND($A$5>7,$A$5<11),\"Função da Utilização Tipo (UT)\",\"Função da Classe de Risco\"))))))))","v":"Função da Utilização Tipo (UT)"},null,null,null,null,null,null,null,null,null,null,null,null,null,null,null,"Nº total máximo de sprinklers em func. simultâneo :","NSsim. =",{"$f":"IF(AU6=\"\",\"? sprink.\",ROUND(AU6,0)&\" sprink.\")","v":"12 sprink."},null,null,null,null,"Comprimento :",null,"Lreal-asp.=",{"$f":"IF(AX6=\"\",\"? m\",ROUND(AX6,1)&\" m\")","v":"? m"},null,null,"nº",{"$f":"IF(AY4=\"\",\"\",AY4)","v":12},null,"m",{"$f":"IF(AR6=\"\",\"\",IF(AR6>=0,AR6,\"\"))","v":""},null,{"$f":"IF(OR(MAX(W25:W49)=\"\",MAX(W25:W49)=0),\"\",MAX(W25:W49))","v":""},{"$f":"IF(AZ6=\"\",\"\",LOOKUP(AZ6,'Quadro 1'!$G$9:$G$23,'Quadro 1'!$E$9:$E$23))","v":""},null,2,"l/s",null,null,null,null,null,2,"bar"]
[null,null,null,null,null,null,null,null,null,"Área de cobertura por sprinkler :","As"," m2",null,null,null,{"$f":"IF(M7<>\"\",M7,IF($A$5=1,20,IF($A$5=11,21,IF(OR($A$5=2,$A$5=3,$A$5=4,$A$5=12,$A$5=13,$A$5=14,$A$5=15),12,IF(OR($A$5=5,$A$5=6,$A$5=16,$A$5=17,$A$5=18),9,IF($A$5=7,9,IF(OR($A$5=8,$A$5=9,$A$5=10),ROUND(P6/P8,1),\"\")))))))","v":12},{"$f":"IF(OR($A$5=1,$A$5=2,$A$5=3,$A$5=4,$A$5=5,$A$5=6,$A$5=7,AND($A$5>=11,$A$5<=18)),\"Função da Classe de Risco\",\"Característica obtida por cálculo\")","v":"Característica obtida por cálculo"},null,null,null,null,null,null,null,null,null,null,null,null,null,null,null,"Nº sprinklers em funcion.simultâneo por sub-ramal :","NSsim./s.r.=",{"$f":"IF(AU7=\"\",\"? sprink.\",ROUND(AU7,0)&\" sprink.\")","v":"4 sprink."},null,null,null,null,"Comp. equiv. local :",null,"Llocal-asp.=",{"$f":"IF(AND(AX7=\"\",AX6=\"\"),\"? m\",IF(AND(AX7=\"\",P14=0),\"? m\",IF(AX7=\"\",\"\",ROUND(AX7,1)&\" m\")))","v":"? m"},null,null,"nº",{"$f":"IF(OR(P6=\"\",P9=\"\"),\"\",IF(AJ$7<>\"\",AJ$7,INT(1.2*(SQRT(P6)/P9))))","v":4},null,"m",{"$f":"IF(AR7=\"\",\"\",IF(AR7>=0,AR7,\"\"))","v":""},null,null,null,null,3,"l/h",null,null,null,null,null,3,"m.c.a."]
[null,null,null,null,null,null,null,null,null,"Nº total mín.sprinklers em func.simultâneo :","NSsim.","nº",null,null,null,{"$f":"IF(M8<>\"\",M8,IF($A$5=8,12,IF($A$5=9,18,IF($A$5=10,29,IF(AND(P6<>\"\",P7<>\"\"),ROUND(P6/P7,0),\"\")))))","v":12},{"$f":"IF(P8=\"\",\"\",IF(AND(AU4<>\"\",P8<AU4),\"Atenção: nº insuficiente de Sprinklers\",IF(AND(AU4<>\"\",P8>AU4),\"Nº de Sprinklers imposto pelo utilizador\",IF(OR($A$5=1,$A$5=2,$A$5=3,$A$5=4,$A$5=5,$A$5=6,$A$5=7,AND($A$5>=11,$A$5<=18)),\"Característica obtida por cálculo\",\"Função da Utilização Tipo (UT)\"))))","v":"Função da Utilização Tipo (UT)"},null,null,null,null,null,null,null,null,null,null,null,null,null,null,null,"Caudal mín. exigido no sprinkler mais desfavorável :","Qmín.S =",{"$f":"IF(AU8=\"\",\"? \"&AT8,ROUND(AU8,$BH$5)&\" \"&AT8)","v":"60 l/min"},null,null,null,null,"Altura - aspiração :",null,"hasp.1) =",{"$f":"IF(AND(AX8=0,AR8=\"\"),\"? m\",ROUND(AX8,1)&\" m\")","v":"? m"},null,null,{"$f":"BG4","v":"l/min"},{"$f":"IF(OR(P10=\"\",P7=\"\",P11=\"\"),\"\",IF(AJ$8<>\"\",AJ$8,IF(P10*P7<$B$17*($P$11*SQRT(50/100)),$B$17*($P$11*SQRT(50/100)),P10*P7)))","v":60},null,"m",{"$f":"IF(AR8=\"\",0,IF(AR8<>\"\",AR8,\"\"))","v":0},null,null,null,null,4,"m³/h",null,null,null,null,null,4,"kgf/cm²",null,null,null,null,null,null,null,null,null,null,null,null,null,null,null,null,null,null,null,null,null,null,null,null,null,null,null,null,null,null,null,null,null,null,null,null,null,null,null,null,null,null,null,null,null,null,null,null,null,null,null,null,null,null,null,null,null,null,"Trajecto Crítico:",{"$f":"IF(25-COUNTBLANK(DT9:ER9)=0,\"\",25-COUNTBLANK(DT9:ER9))","v":""},1,2,3,4,5,6,7,8,9,10,11,12,13,14,15,16,17,18,19,20,21,22,23,24,25]
{"$rows_left_out":188}
{"sheet":"Curvas da Instalação","index":1,"n_rows":142,"n_cols":44,"rows_kept":142,"cut":false,"hidden":false,"merged":[[53,12,53,14],[52,2,52,3],[53,1,53,3],[53,5,53,8],[54,1,54,3],[53,10,53,11]]}
[]
[]
[]
[null,null,"Equação geral da curva da instalação:"]
[]
[]
[]
[]
{"$rows_left_out":135}
{"sheet":"Quadro 1","index":2,"n_rows":34,"n_cols":15,"rows_kept":34,"cut":false,"hidden":false,"merged":[[5,3,5,4],[6,11,6,12],[6,13,6,14],[5,11,5,14],[5,7,5,9],[6,7,6,9]]}
[]
[null,null," Dimensionamento de Sistema de Extinção Automática (Rede de Sprinklers Tipo Húmida)"]
[]
[null,null,"Quadro 1:","Gama de Tubos de Aço para Canalizações soldados longitudinalmente (W)"]
[]
[null,null,null,"Dimensão Nominal",null,null,"Diâm.","Diâmetro Exterior",null,null,"Espessura","Massa Nominal em função das extremidades: (kg / m) "]
[null,null,null,null,null,null,"Interior","D (mm)",null,null,"T (mm)","Tubo Preto",null,"Tubo Galvanizado"]
[null,null,null,"( R )","(DN)",null,"(mm)","Nominal","Máx.","Min.","Nominal","Lisos","Rosc.c/ aces. ","Lisos","Rosc.c/ aces. "]
{"$rows_left_out":27}
{"sheet":"Quadro 2","index":3,"n_rows":77,"n_cols":93,"rows_kept":77,"cut":false,"hidden":false,"merged":[[4,22,8,22],[3,10,3,28],[3,29,3,34],[3,35,3,39],[4,10,8,10],[4,11,8,11],[4,12,8,12],[4,13,8,13],[4,14,8,14],[4,15,8,15],[4,16,8,16],[4,17,8,17],[4,18,8,18],[4,19,8,19],[4,20,8,20],[4,21,8,21],[4,34,8,34],[4,23,8,23],[4,24,8,24],[4,25,8,25],[4,26,8,26],[4,27,8,27],[4,28,8,28],[4,29,8,29],[4,30,8,30],[4,31,8,31],[4,32,8,32],[4,33,8,33],[4,49,8,49],[4,35,8,35],[4,36,8,36],[4,37,8,37],[4,38,8,38],[4,39,8,39],[4,43,8,43],[4,66,8,66],[4,67,8,67],[4,56,8,56],[4,57,8,57],[4,58,8,58],[4,59,8,59],[4,60,8,60],[4,61,8,61],[8,6,8,8],[4,62,8,62],[4,63,8,63],[4,64,8,64],[4,65,8,65],[4,50,8,50],[4,51,8,51],[4,52,8,52],[4,53,8,53],[4,54,8,54],[4,55,8,55],[4,44,8,44],[4,45,8,45],[4,46,8,46],[4,47,8,47],[4,48,8,48],[37,79,37,81],[37,82,37,84],[8,77,8,89],[9,2,9,4],[10,74,11,74],[10,75,11,75],[33,74,34,74],[33,75,34,75],[33,76,34,76],[4,68,8,68],[4,69,8,69],[4,70,8,70],[4,71,8,71],[4,72,8,72],[7,3,7,4],[8,2,8,4],[35,77,35,79],[35,81,35,83],[35,84,35,86],[36,78,36,80],[36,81,36,84],[41,82,41,85],[60,77,60,92],[69,77,69,92],[38,79,38,82],[38,83,38,85],[39,80,39,82],[39,83,39,86],[40,80,40,83],[40,84,40,87]]}
[]
[]
[]
[null,null,"Quadro 2",null,null,null,null,null,null,null,"Acessórios roscados em fundição maleável conformes NP EN 10242",null,null,null,null,null,null,null,null,null,null,null,null,null,null,null,null,null,null,"Acessórios ranhurados",null,null,null,null,null,"Válvulas"]
[null,null,"Matriz de afectação dos acessórios utilizados",null,null,null,null,null,null,null,{"$f":"AR5","v":"Curva m/f 90"},"Curva m/f curta 90","Curva fêmea 90","Curva fêmea curta 90","Curva macho 90","Curva m/f 45","Curva  fêmea 45","União de cruzamento","Joelho simples 90","Joelho m/f simples 90","Joelho simples 45","Tê simples 90","Tê de redução","Cruzeta","Joelho de 3 vias","União de redução","União simples","Junção sede plana","Junção sede cónica","União ranhurada","Uniáo de red. ranhurada","Joelho 90º ranhurado","Joelho 45º ranhurado","Tê ranhurado","Derivação roscada","Válvula de comporta","Válvula de globo","Válvula de retenção","Válvula de aspiração","Válvula de corte BI",null,null,null,{"$f":"$BX$13","v":"Curva m/f 90"},{"$f":"$BX$14","v":"Curva m/f curta 90"},{"$f":"$BX$15","v":"Curva fêmea 90"},{"$f":"$BX$16","v":"Curva fêmea curta 90"},{"$f":"$BX$17","v":"Curva macho 90"},{"$f":"$BX$18","v":"Curva m/f 45"},{"$f":"$BX$19","v":"Curva  fêmea 45"},{"$f":"$BX$20","v":"União de cruzamento"},{"$f":"$BX$21","v":"Joelho simples 90"},{"$f":"$BX$23","v":"Joelho m/f simples 90"},{"$f":"$BX$29","v":"Joelho simples 45"},{"$f":"$BX$31","v":"Tê simples 90"},{"$f":"$BX$34","v":"Tê de redução"},{"$f":"$BX$44","v":"Cruzeta"},{"$f":"$BX$46","v":"Joelho de 3 vias"},{"$f":"$BX$47","v":"União de redução"},{"$f":"$BX$51","v":"União simples"},{"$f":"$BX$55","v":"Junção sede plana"},{"$f":"$BX$57","v":"Junção sede cónica"},{"$f":"$BX$63","v":"União ranhurada"},{"$f":"$BX$64","v":"Uniáo de red. ranhurada"},{"$f":"$BX$65","v":"Joelho 90º ranhurado"},{"$f":"$BX$66","v":"Joelho 45º ranhurado"},{"$f":"$BX$67","v":"Tê ranhurado"},{"$f":"$BX$69","v":"Derivação roscada"},{"$f":"$BX$72","v":"Válvula de comporta"},{"$f":"$BX$73","v":"Válvula de globo"},{"$f":"$BX$74","v":"Válvula de retenção"},{"$f":"$BX$76","v":"Válvula de aspiração"},{"$f":"$BX$77","v":"Válvula de corte BI"}]
[null,null,"(cálculo do comprimento equivalente)"]
[null,null,1,2,3,16,7,7,7]
[null,null,null,{"$f":"'Cálc. Sist. Extinção Automática'!F20","v":"0.2"},null,"Quadro 1","3.3","3.3a","3.3b",null,null,null,null,null,null,null,null,null,null,null,null,null,null,null,null,null,null,null,null,null,null,null,null,null,null,null,null,null,null,null,null,null,null,null,null,null,null,null,null,null,null,null,null,null,null,null,null,null,null,null,null,null,null,null,null,null,null,null,null,null,null,null,null,null,"Quadro 2:","Comprimentos Equivalentes (em \"metros\") - Acessórios Roscados em ferro fundido maleável, conformes EN 10242."]
{"$rows_left_out":70}
{"sheet":"Quadros 3 a 5-RTSCIE","index":4,"n_rows":2,"n_cols":2,"rows_kept":2,"cut":false,"hidden":false,"merged":[[12,3,12,5],[12,7,13,7],[12,8,13,8],[10,10,11,10],[9,11,10,11],[10,7,11,7],[10,8,11,8],[8,10,9,10],[12,9,13,9],[12,10,13,10],[8,9,9,9],[12,6,13,6],[13,3,13,5],[3,2,3,11],[4,1,4,2],[4,3,4,5],[4,6,5,6],[4,7,4,10],[6,1,6,2],[4,11,5,11],[5,7,6,7],[10,9,11,9],[9,2,10,2],[9,3,10,5],[7,3,7,5],[8,3,8,5],[6,3,6,5],[8,6,11,6],[8,7,9,7],[11,3,11,5],[8,8,9,8]]}
[]
[null," RTSCIE - Dimensionamento de Sistema de Extinção Automática (Rede de Sprinklers Tipo Húmida)"]

{"sheet":"Quadros 3 a 5-EN 12845","index":5,"n_rows":0,"n_cols":0,"rows_kept":0,"cut":false,"hidden":false,"merged":[[3,2,3,11],[4,1,4,2],[4,3,4,5],[4,6,5,6],[4,7,4,10],[4,11,5,11],[5,7,6,7],[6,1,6,2],[6,3,6,5],[7,3,7,5],[8,3,8,5],[8,6,11,6],[8,7,9,7],[8,8,9,8],[9,11,10,11],[10,7,11,7],[10,8,11,8],[10,9,11,9],[10,10,11,10],[8,9,9,9],[12,10,13,10],[13,3,13,5],[8,10,9,10],[9,2,10,2],[9,3,10,5],[11,3,11,5],[12,3,12,5],[12,6,13,6],[12,7,13,7],[12,8,13,8],[12,9,13,9]]}

{"sheet":"Quadros 3 a 6-NFPA 13","index":6,"n_rows":64,"n_cols":17,"rows_kept":64,"cut":false,"hidden":false,"merged":[[62,1,62,5],[52,1,52,2],[17,2,17,5],[25,2,25,4],[51,2,51,5],[26,1,26,2],[29,1,29,2],[18,1,18,2],[44,1,46,1],[47,1,48,1],[5,7,6,7],[14,2,14,5],[4,1,4,2],[4,3,4,5],[9,3,10,5],[6,1,6,2],[6,3,6,5],[7,3,7,5],[3,2,3,11],[12,6,13,6],[13,3,13,5],[8,3,8,5],[8,6,11,6],[11,3,11,5],[9,2,10,2],[12,3,12,5],[10,7,11,7],[4,11,5,11],[4,6,5,6],[4,7,4,10],[10,8,11,8],[10,9,11,9],[10,10,11,10],[8,9,9,9],[9,11,10,11],[8,7,9,7],[8,8,9,8],[12,7,13,7],[12,8,13,8],[12,9,13,9],[12,10,13,10],[8,10,9,10]]}
[]
[null,null,null,null,null,null,null,null,null,null,null,null,null,null,"Utilização Tipo II (RTSCIE)",8,1]
[null,null,null,null,null,null,null,null,null,null,null,null,null,null,"Utilização Tipo III (RTSCIE)",9,2]
[null,"Quadro 3:","Área máxima de cobertura por sprinkler, valores de S e D e área de operação em função da classe de risco",null,null,null,null,null,null,null,null,null,null,null,"Utilização Tipo VI (RTSCIE)",9,3]
[null,"Classe de Risco",null,"Tipo de edifício",null,null,"Área máxima a proteger por sprinkler (As)","Valores de S e D",null,null,null,"Área de operação (Ao)",null,null,"Utilização Tipo VII (RTSCIE)",9,4]
[null,null,null,null,null,null,null,"Tipo de disposição","S","D","SxD",null,null,null,"Utilização Tipo VIII (RTSCIE)",9,5]
[null,null,null,null,null,null,"(m2)",null,"(m)","(m)","(m2)","(m2)",null,null,"Utilização Tipo XII (RTSCIE)",10,6]
[null,"Ligeiros",null,"Apartamentos, igrejas, clubes, escolas, hospitais, escritórios, museus, etc.",null,null,20,"Normal",4,4.5999999999999996,20,139,null,null,"Ligeiro (EN 12845)",11,7]
{"$rows_left_out":57}
{"sheet":"Gráficos 1 e 2-NFPA 13","index":7,"n_rows":23,"n_cols":12,"rows_kept":23,"cut":false,"hidden":false,"merged":[[5,2,5,5],[16,1,16,3],[5,9,5,10],[16,8,16,10]]}
[]
[]
[]
[null," Gráfico 1 Curvas de densidade - Riscos Ligeiros e Ordinários",null,null,null,null,null,null,"Gráfico 2 Curvas de densidade - Riscos Graves"]
[]
[null,"Área de operação","Densidade",null,null,null,null,null,"Área de operação","Densidade"]
[null," m2","l/min.m2","l/min.m2","l/min.m2","l/min.m2",null,null," m2","l/min.m2","l/min.m2"]
[null,null,"Ligeiro","Ordinário G1","Ordinário G2","Ordinário G3",null,null,null,"Grave G1","Grave G2"]
{"$rows_left_out":16}
{"sheet":"Instruções","index":8,"n_rows":0,"n_cols":0,"rows_kept":0,"cut":false,"hidden":false,"merged":[]}

{"sheet":"Procedimento","index":9,"n_rows":87,"n_cols":14,"rows_kept":87,"cut":false,"hidden":false,"merged":[[62,4,63,4],[60,4,61,4],[41,1,42,1],[17,8,17,13],[34,5,35,5],[34,6,35,6],[34,7,35,7],[18,8,18,13],[52,8,52,13],[49,8,49,13],[51,8,51,13],[39,8,39,13],[42,8,42,13],[25,8,25,13],[19,8,19,13],[41,8,41,13],[12,1,13,1],[13,3,16,3],[12,4,16,4],[58,3,59,3],[56,3,57,3],[33,1,34,1],[33,3,36,3],[41,3,43,3],[18,1,19,1],[33,8,33,13],[40,8,40,13],[69,8,69,13],[70,8,70,13],[71,8,71,13],[57,8,57,13],[43,8,44,9],[43,10,44,13],[67,8,67,13],[65,8,66,13],[55,8,55,13],[56,8,56,13],[53,8,53,13],[58,8,58,13],[54,8,54,13],[64,8,64,13],[69,3,71,3],[67,3,68,3],[80,3,80,7],[78,8,78,13],[85,8,85,13],[73,8,73,12],[82,8,82,13],[83,8,83,13],[84,8,84,13],[68,8,68,13],[72,8,72,13],[81,8,81,13],[80,8,80,13],[45,8,45,12],[46,10,46,13],[48,8,48,12],[50,8,50,13],[63,8,63,13],[62,8,62,13],[60,8,61,13],[21,8,21,13],[32,8,32,13],[20,8,20,13],[27,8,27,13],[29,8,29,13],[30,8,30,13],[22,8,22,13],[31,8,31,13],[26,8,26,13],[28,8,28,13],[62,5,63,5],[62,6,63,6],[62,7,63,7],[60,5,61,5],[60,6,61,6],[60,7,61,7]]}
[]
[]
[]
[null,null,"Seleccionar o procedimento pretendido:"]
[null,null,null,"Dimensionamento conforme RTSCIE (X)"]
[null,null,null,"Dimensionamento conforme NFPA 13 ou EN 12845 (X)"]
[]
[]
{"$rows_left_out":80}
{"sheet":"Conversões","index":10,"n_rows":29,"n_cols":10,"rows_kept":29,"cut":false,"hidden":false,"merged":[]}
[]
[]
[]
[]
[]
[]
[]
[]
{"$rows_left_out":21}