{"text_format":"1","workbook":"xlsx","n_sheets":11,"sheets":["Cálc. Sist. Extinção Automática","Curvas da Instalação","Quadro 1","Quadro 2","Quadros 3 a 5-RTSCIE","Quadros 3 a 5-EN 12845","Quadros 3 a 6-NFPA 13","Gráficos 1 e 2-NFPA 13","Instruções","Procedimento","Conversões"],"not_rendered":{"charts":3,"images":91,"macros":1,"external_links":0,"defined_names":10,"comments":4,"pivot_tables":0},"unopened":[],"bounds":{"document_bytes":16777216,"sheet_cells":100000,"rows_first":2000,"rows_last":500,"rows_between":2000,"halvings":0,"cell_chars":16384,"cell_head_chars":4096},"cells_cut":0,"cells_raw":0,"read":"whole","date_system":"1900"}

{"sheet":"Cálc. Sist. Extinção Automática","index":0,"n_rows":195,"n_cols":259,"rows_kept":195,"cut":false,"hidden":false,"merged":[[20,28,20,29],[18,26,18,27],[20,4,20,6],[21,4,21,6],[19,5,19,6],[18,5,18,6],[50,8,50,20],[20,26,20,27],[20,20,20,25],[22,26,22,27],[21,26,21,27],[20,16,20,17],[20,7,20,8],[20,9,20,12],[9,4,9,5],[10,4,10,5],[7,16,7,22],[8,16,8,22],[1,40,1,42],[1,22,1,26],[5,35,5,36],[1,29,1,36],[4,4,4,5],[5,4,5,5],[6,4,6,5],[8,4,8,5],[6,35,6,36],[7,35,7,36],[7,4,7,5],[11,37,11,43],[17,35,17,36],[15,35,15,36],[11,35,11,36],[23,40,23,42],[20,30,20,38],[22,35,22,37],[20,39,20,42],[21,40,21,42],[21,35,21,38],[18,40,18,42],[19,40,19,42],[19,35,19,38],[18,35,18,38],[45,40,45,42],[46,40,46,42],[43,40,43,42],[33,40,33,42],[34,40,34,42],[35,40,35,42],[36,40,36,42],[39,40,39,42],[41,40,41,42],[37,40,37,42],[38,40,38,42],[40,40,40,42],[30,40,30,42],[26,40,26,42],[24,40,24,42],[44,40,44,42],[32,40,32,42],[31,40,31,42],[27,40,27,42],[28,40,28,42],[48,40,48,42],[25,40,25,42],[30,35,30,38],[25,35,25,38],[42,40,42,42],[47,40,47,42],[35,35,35,38],[36,35,36,38],[43,35,43,38],[33,35,33,38],[34,35,34,38],[39,35,39,38],[37,35,37,38],[46,35,46,38],[47,35,47,38],[29,40,29,42],[24,35,24,38],[23,35,23,38],[48,35,48,38],[32,35,32,38],[38,35,38,38],[42,35,42,38],[40,35,40,38],[41,35,41,38],[44,35,44,38],[45,35,45,38],[31,35,31,38],[29,35,29,38],[26,35,26,38],[27,35,27,38],[28,35,28,38]]}
[]
[null,null,null,null,null,null,null,null,null,null,null,null,null,null,null,null,null,null,null,null,"Ref.ª",null,null,null,null,null,null,null,"Descrição:",null,null,null,null,null,null,null,null,null,null,"Data:",null,null,null,null,null,null,null,"Controlo do arranjo dos sprinklers"]
[]
[null,null,null,null,"Características e Especificações:",null,null,null,null,null,null,null,"Decisões",null,null,"Adoptado"," Observações",null,null,null,null,null,null,null,null,null,null," Especificações calculadas",null,null,null,null,null,null,null,null,null," Tubagem de aspiração",null,null,null,null,null,null,null,null,{"$f":"IF($A$5=8,12,IF($A$5=9,18,IF($A$5=10,29,IF(AND(P6<>\"\",P7<>\"\"),ROUND(P6/P7,0),\"\"))))","v":12},{"$f":"IF(P8=\"\",\"\",P8)","v":12},{"$f":"IF(OR(AV4=\"\",AU7=\"\"),\"\",AV4/AU7)","v":3},{"$f":"IF(AW4=\"\",\"\",INT(AW4))","v":3},{"$f":"IF(OR(AU7=\"\",AV4=\"\",AX4=\"\"),\"\",IF(AU7*AX4=AV4,AV4,IF(AU7*AX4<AV4,AU7*(AX4+1),AU7*AX4)))","v":12},null,null,null,{"$f":"A17","v":1},"Conversão de caudal",null,null,{"$f":"IF($BC$4=2,\"l/s\",IF($BC$4=3,\"l/h\",IF($BC$4=4,\"m³/h\",\"l/min\")))","v":"l/min"},"Arred.",null,{"$f":"A18","v":1},"Conversão de pressão",{"$f":"IF($BJ$4=2,\"bar\",IF($BJ$4=3,\"m.c.a.\",IF($BJ$4=4,\"kgf/cm²\",\"kPa\")))","v":"kPa"},"Arred."]
[{"$f":"IF(B5=1,8,IF(OR(B5=2,B5=3,B5=4,B5=5),9,IF(B5=6,10,IF(B5=21,7,IF(AND(B5>=7,B5<=14),B5+4,B5-14)))))","v":8},1,null,null,null,null,null,null,null,"Classe e Grupo de Risco/Utilização Tipo :",null,null,null,null,null,{"$f":"IF($A$5=\"\",\"\",IF(OR($A$5=1,$A$5=2,$A$5=3,$A$5=4,$A$5=5,$A$5=6),\" Dimensionamento em conformidade com NFPA 13\",IF(OR($A$5=8,$A$5=9,$A$5=10),\" Dimensionamento em conformidade com RTSCIE\",IF(OR($A$5=11,$A$5=12,$A$5=13,$A$5=14,$A$5=15,$A$5=16,$A$5=17,$A$5=18),\" Dimensionamento em conformidade com EN 12845\",IF($A$5=7,\" Outra Classe de Riscos\",\"\")))))","v":" Dimensionamento em conformidade com RTSCIE"},null,null,null,null,null,null,null,null,null,null,null,null,null,null,null,null,"Afastamento máx. entre sub-ramais com sprinklers :","D =",{"$f":"IF(AU5=\"\",\"? m\",ROUND(AU5,2)&\" m\")","v":"3,45 m"},null,null,null,null,"Diâmetro interior :",null,"Di-asp.=",{"$f":"IF(AX5=\"\",\"? m\",ROUND(AX5,1)&\" mm\")","v":"? m"},null,null,"m",{"$f":"IF(OR(P7=\"\",P9=\"\"),\"\",IF($A$5=11,FLOOR(P7/P9,0.1),FLOOR(P7/P9,0.05)))","v":3.45},null,"mm",{"$f":"IF(OR(MAX(W25:W49)=\"\",MAX(W25:W49)=0),\"\",IF(AK5=\"\",MAX(MAX(W25:W49),BJ12),IF(AND(OR(AK5=\"x\",AK5<>\"\"),MAX(W25:W49)=27.3),36,IF(AND(OR(AK5=\"x\",AK5<>\"\"),MAX(W25:W49)=36),41.9,IF(AND(OR(AK5=\"x\",AK5<>\"\"),MAX(W25:W49)=41.9),53.1,IF(AND(OR(AK5=\"x\",AK5<>\"\"),MAX(W25:W49)=53.1),68.9,IF(AND(OR(AK5=\"x\",AK5<>\"\"),MAX(W25:W49)=68.9),80.9,IF(AND(OR(AK5=\"x\",AK5<>\"\"),MAX(W25:W49)=80.9),105.3,IF(AND(OR(AK5=\"x\",AK5<>\"\"),MAX(W25:W49)=105.3),129.7,IF(AND(OR(AK5=\"x\",AK5<>\"\"),MAX(W25:W49)=129.7),155.1,IF(AND(OR(AK5=\"x\",AK5<>\"\"),MAX(W25:W49)=155.1),206.5,IF(AND(OR(AK5=\"x\",AK5<>\"\"),MAX(W25:W49)=206.5),260.4,IF(AND(OR(AK5=\"x\",AK5<>\"\"),MAX(W25:W49)=260.4),311.3,311.3)))))))))))))","v":""},{"$f":"IF(AX5=\"\",\"\",LOOKUP(AX5,'Quadro 1'!$G$9:$G$23,'Quadro 1'!$E$9:$E$23))","v":""},{"$f":"IF(OR(AX5=\"\",AU15=\"\"),\"\",(66.7*AU15/$B$17)/(PI()*AX5^2))","v":""},{"$f":"IF(OR(AX5=\"\",MIN(R25:R49)=0),\"\",(66.7*MIN(R25:R49)/$B$17)/(PI()*AX5^2))","v":""},"Velocidade na tubagem de aspiração (m/s)",1,"l/min",null,null,null,{"$f":"IF(BC4=2,2,IF(BC4=3,0,IF(BC4=4,1,1)))","v":1},null,1,"kPa",null,{"$f":"IF(OR(BJ4=2,BJ4=3,BJ4=4),2,1)","v":1}]
[null,{"$f":"IF(OR($A$5=8,$A$5=13),144,IF(OR($A$5=9,$A$5=14),216,IF(OR($A$5=10,$A$5=16,$A$5=17,$A$5=18),260,IF($A$5=11,84,IF($A$5=12,72,IF($A$5=15,360,\"\"))))))","v":144},null,null,null,null,null,null,null,"Área de operação :","Ao"," m2",null,null,null,{"$f":"IF(M6<>\"\",M6,IF($A$5=1,139,IF($A$5=2,139,IF($A$5=3,279,IF($A$5=4,372,IF($A$5=5,372,IF($A$5=6,465,IF($A$5=7,\"\",B6))))))))","v":144},{"$f":"IF(AND($A$5=1,P6<>139),\"Atenção: Área de operação fora de especificação\",IF(AND(OR($A$5=2,$A$5=3,$A$5=4),AND(P6<>139,P6<>279,P6<>372)),\"Atenção: Área de operação fora de especificação\",IF(AND(OR($A$5=5,$A$5=6),AND(P6<>372,P6<>465)),\"Atenção: Área de operação fora de especificação\",IF($A$5=7,\"Função da Classe de Risco\",IF(AND($A$5=8,P6<>144),\"Atenção: Área de operação fora de especificação\",IF(AND($A$5=9,P6<>216),\"Atenção: Área de operação fora de especificação\",IF(AND($A$5=10,P6<>260),\"Atenção: Área de operação fora de especificação\",IF(AND($A$5>7,$A$5<11),\"Função da Utilização Tipo (UT)\",\"Função da Classe de Risco\"))))))))","v":"Função da Utilização Tipo (UT)"},null,null,null,null,null,null,null,null,null,null,null,null,null,null,null,"Nº total máximo de sprinklers em func. simultâneo :","NSsim. =",{"$f":"IF(AU6=\"\",\"? sprink.\",ROUND(AU6,0)&\" sprink.\")","v":"12 sprink."},null,null,null,null,"Comprimento :",null,"Lreal-asp.=",{"$f":"IF(AX6=\"\",\"? m\",ROUND(AX6,1)&\" m\")","v":"? m"},null,null,"nº",{"$f":"IF(AY4=\"\",\"\",AY4)","v":12},null,"m",{"$f":"IF(AR6=\"\",\"\",IF(AR6>=0,AR6,\"\"))","v":""},null,{"$f":"IF(OR(MAX(W25:W49)=\"\",MAX(W25:W49)=0),\"\",MAX(W25:W49))","v":""},{"$f":"IF(AZ6=\"\",\"\",LOOKUP(AZ6,'Quadro 1'!$G$9:$G$23,'Quadro 1'!$E$9:$E$23))","v":""},null,2,"l/s",null,null,null,null,null,2,"bar"]
[null,null,null,null,null,null,null,null,null,"Área de cobertura por sprinkler :","As"," m2",null,null,null,{"$f":"IF(M7<>\"\",M7,IF($A$5=1,20,IF($A$5=11,21,IF(OR($A$5=2,$A$5=3,$A$5=4,$A$5=12,$A$5=13,$A$5=14,$A$5=15),12,IF(OR($A$5=5,$A$5=6,$A$5=16,$A$5=17,$A$5=18),9,IF($A$5=7,9,IF(OR($A$5=8,$A$5=9,$A$5=10),ROUND(P6/P8,1),\"\")))))))","v":12},{"$f":"IF(OR($A$5=1,$A$5=2,$A$5=3,$A$5=4,$A$5=5,$A$5=6,$A$5=7,AND($A$5>=11,$A$5<=18)),\"Função da Classe de Risco\",\"Característica obtida por cálculo\")","v":"Característica obtida por cálculo"},null,null,null,null,null,null,null,null,null,null,null,null,null,null,null,"Nº sprinklers em funcion.simultâneo por sub-ramal :","NSsim./s.r.=",{"$f":"IF(AU7=\"\",\"? sprink.\",ROUND(AU7,0)&\" sprink.\")","v":"4 sprink."},null,null,null,null,"Comp. equiv. local :",null,"Llocal-asp.=",{"$f":"IF(AND(AX7=\"\",AX6=\"\"),\"? m\",IF(AND(AX7=\"\",P14=0),\"? m\",IF(AX7=\"\",\"\",ROUND(AX7,1)&\" m\")))","v":"? m"},null,null,"nº",{"$f":"IF(OR(P6=\"\",P9=\"\"),\"\",IF(AJ$7<>\"\",AJ$7,INT(1.2*(SQRT(P6)/P9))))","v":4},null,"m",{"$f":"IF(AR7=\"\",\"\",IF(AR7>=0,AR7,\"\"))","v":""},null,null,null,null,3,"l/h",null,null,null,null,null,3,"m.c.a."]
[null,null,null,null,null,null,null,null,null,"Nº total mín.sprinklers em func.simultâneo :","NSsim.","nº",null,null,null,{"$f":"IF(M8<>\"\",M8,IF($A$5=8,12,IF($A$5=9,18,IF($A$5=10,29,IF(AND(P6<>\"\",P7<>\"\"),ROUND(P6/P7,0),\"\")))))","v":12},{"$f":"IF(P8=\"\",\"\",IF(AND(AU4<>\"\",P8<AU4),\"Atenção: nº insuficiente de Sprinklers\",IF(AND(AU4<>\"\",P8>AU4),\"Nº de Sprinklers imposto pelo utilizador\",IF(OR($A$5=1,$A$5=2,$A$5=3,$A$5=4,$A$5=5,$A$5=6,$A$5=7,AND($A$5>=11,$A$5<=18)),\"Característica obtida por cálculo\",\"Função da Utilização Tipo (UT)\"))))","v":"Função da Utilização Tipo (UT)"},null,null,null,null,null,null,null,null,null,null,null,null,null,null,null,"Caudal mín. exigido no sprinkler mais desfavorável :","Qmín.S =",{"$f":"IF(AU8=\"\",\"? \"&AT8,ROUND(AU8,$BH$5)&\" \"&AT8)","v":"60 l/min"},null,null,null,null,"Altura - aspiração :",null,"hasp.1) =",{"$f":"IF(AND(AX8=0,AR8=\"\"),\"? m\",ROUND(AX8,1)&\" m\")","v":"? m"},null,null,{"$f":"BG4","v":"l/min"},{"$f":"IF(OR(P10=\"\",P7=\"\",P11=\"\"),\"\",IF(AJ$8<>\"\",AJ$8,IF(P10*P7<$B$17*($P$11*SQRT(50/100)),$B$17*($P$11*SQRT(50/100)),P10*P7)))","v":60},null,"m",{"$f":"IF(AR8=\"\",0,IF(AR8<>\"\",AR8,\"\"))","v":0},null,null,null,null,4,"m³/h",null,null,null,null,null,4,"kgf/cm²",null,null,null,null,null,null,null,null,null,null,null,null,null,null,null,null,null,null,null,null,null,null,null,null,null,null,null,null,null,null,null,null,null,null,null,null,null,null,null,null,null,null,null,null,null,null,null,null,null,null,null,null,null,null,null,null,null,null,"Trajecto Crítico:",{"$f":"IF(25-COUNTBLANK(DT9:ER9)=0,\"\",25-COUNTBLANK(DT9:ER9))","v":""},1,2,3,4,5,6,7,8,9,10,11,12,13,14,15,16,17,18,19,20,21,22,23,24,25]
[null,null,null,null,null,null,null,null,null,"Espaçamento entre sprinkers :","S","m",null,null,null,{"$f":"IF(M9<>\"\",M9,IF($A$5=11,4.5,IF($A$5=1,4,IF(OR($A$5=2,$A$5=3,$A$5=4,$A$5=8,$A$5=9,$A$5=12,$A$5=13,$A$5=14,$A$5=15),3.45,IF(OR($A$5=5,$A$5=6,$A$5=10,$A$5=16,$A$5=17,$A$5=18),3,IF($A$5=7,\"\",\"\"))))))","v":3.45},{"$f":"IF(P9=\"\",\"Função da Classe de Risco\",IF(P9>4.6,\"Atenção: Espaçamento superior ao permitido\",IF(AND($A$5=11,P9<=4.6),\"Sprinklers em disposição normal (máx = 4,6 m)\",IF(AND(OR($A$5=1,$A$5=2,$A$5=3,$A$5=4,$A$5=8,$A$5=9,$A$5=12,$A$5=13,$A$5=14,$A$5=15),P9<=4),\"Sprinklers em disposição normal (máx. = 4 m)\",IF(AND(OR($A$5=2,$A$5=3,$A$5=4,$A$5=8,$A$5=9,$A$5=11),P9>4,P9<=4.6),\"Sprinklers em disposição intercalada (máx. = 4,6 m)\",IF(AND(OR($A$5=5,$A$5=6,$A$5=10,$A$5=16,$A$5=17,$A$5=18),P9<=3.7),\"Sprinklers em disposição normal (máx = 3,7 m)\",IF($A$5=7,\"\",\"Atenção: Espaçamento superior ao permitido\")))))))","v":"Sprinklers em disposição normal (máx. = 4 m)"},null,null,null,null,null,null,null,null,null,null,null,null,null,null,null,"Pressão dinâmica no sprinkler mais desfavorável :","Pmín.S =",{"$f":"IF(AU9=\"\",\"? \"&AT9,ROUND(AU9,$BM$5)&\" \"&AT9)","v":"56,3 kPa"},null,null,null,null,"Comp. equiv. total :",null,"Leq.-asp.=",{"$f":"IF(AX9=\"\",\"? m\",ROUND(AX9,2)&\" m\")","v":"? m"},null,null,{"$f":"BL4","v":"kPa"},{"$f":"IF(OR(AU8=\"\",P11=\"\",P11=0),\"\",IF($B$18*100*($AU$8/$B$17/$P$11)^2<50*$B$18,50*$B$18,$B$18*100*($AU$8/$B$17/$P$11)^2))","v":56.25},null,"m",{"$f":"IF(AX6=\"\",\"\",IF(AX7=\"\",AX6*(1+$P$14),IF(AND(AX6<>\"\",AX7<>\"\"),AX6+AX7)))","v":""},null,null,null,null,null,null,null,null,null,null,null,"Bloco unidades",null,null,null,null,null,null,null,null,null,null,null,null,null,null,null,null,null,null,null,null,null,null,null,null,null,null,null,null,null,null,null,null,null,null,null,null,null,null,null,null,null,null,null,null,null,null,null,null,null,null,null,null,null,null,null,null,null,null,null,"Início:",{"$f":"IF($DS$8=\"\",\"\",HLOOKUP(DS8,DT8:ER9,2,FALSE))","v":""},{"$f":"IF($EW$23=\"\",\"\",LOOKUP($EW$23,$EU$25:$EU$49,DT25:DT49))","v":""},"","","","","","","","","","","","","","","","","","","","","","","",""]
[null,{"$f":"IF($A$5=11,2.25,IF($A$5=8,5,IF(OR($A$5=9,$A$5=12,$A$5=13,$A$5=14,$A$5=15),5,IF($A$5=16,7.5,IF(OR($A$5=10,$A$5=17),10,IF($A$5=18,12.5,\"\"))))))","v":5},null,null,null,null,null,null,null,"Caudal unitário a dispersar por sprinkler :","qunit.",{"$f":"IF($BC$4=2,\"l/s.m²\",IF($BC$4=3,\"l/h.m²\",IF($BC$4=4,\"m³/h.m²\",\"l/min.m²\")))","v":"l/min.m²"},null,null,null,{"$f":"IF(AND(M10<>\"\",P6<>\"\"),M10,IF($A$5=1,$B$17*CEILING(0.000004*P6^2-0.0112*P6+(5.5681+0.01),0.01),IF($A$5=2,$B$17*(CEILING(0.000009*P6^2-0.0154*P6+8.4806,0.01)),IF($A$5=3,$B$17*CEILING(0.000003*P6^2-0.0101*P6+(9.0632-0.06),0.01),IF($A$5=4,$B$17*CEILING(0.000006*P6^2-0.0113*P6+(9.9444+0.06),0.01),IF($A$5=5,$B$17*CEILING(-0.000003*P6^2-0.0104*P6+14.351,0.1),IF($A$5=6,$B$17*CEILING(0.000004*P6^2-0.015*P6+(18.379+0.03),0.1),IF($A$5=7,\"\",$B$17*B10))))))))","v":5},"Densidade de descarga",null,null,null,null,null,null,null,null,null,null,null,null,null,null,null,{"$f":"IF(OR($DS$9=\"\",$DS$9=0,$DT$9=\"\",$DT$9=0),\"Comprimento real crítico :\",\"Comprimento real crítico, relativo ao trajecto \"&DS9&\"-\"&DT9&\" :\")","v":"Comprimento real crítico :"},"Lcrítico =",{"$f":"IF(AU10=\"\",\"? m\",ROUND(AU10,2)&\" \"&AT10)","v":"? m"},null,null,null,null,"Perda carga total :",null,"ΔPtotal-asp.=",{"$f":"IF(OR(AQ5=\"? m\",AX10=\"\",AX10=0),\"? \"&AW10,ROUND(AX10,$BH$5+2)&\" \"&AW10)","v":"? kPa"},null,null,"m",{"$f":"IF(EW23=\"\",\"\",LOOKUP(EW23,EU25:EU49,FE25:FE49))","v":""},null,{"$f":"BL4","v":"kPa"},{"$f":"IF(BC10=\"\",\"\",IF(OR(AX8=\"\",AX8=0),BC10,BC10+AX8*$AU$19/$BK$11))","v":0},{"$f":"IF(BD10=\"\",\"\",IF(OR(AX8=\"\",AX8=0),BD10,BD10+AX8*$AU$19/BK11))","v":0},"Δdin.-asp. =",{"$f":"IF(BC10=0,\"\",ROUND(BC10,$BM$5+2)&\" \"&BB10)","v":""},{"$f":"BL4","v":"kPa"},{"$f":"IF(OR($P$16=\"\",AX9=\"\",AX5=\"\",AU15=\"\"),0,IF($M$15=\"\",AX9*$B$18*$AU$19*61.7*100000*((AU15/$B$17)^1.85/($P$16^1.85*AX5^4.87)),AX9*$B$18*$AU$19*((4*$P$16*((AZ5^7)/(AX5/1000))^(1/4))/(AX5/1000))))","v":0},{"$f":"IF(OR($P$16=\"\",AX9=\"\",AX5=\"\",AU15=\"\"),0,IF($M$15=\"\",AX9*$B$18*$AU$19*61.7*100000*((MIN(R25:R49)/$B$17)^1.85/($P$16^1.85*AX5^4.87)),AX9*$B$18*$AU$19*((4*$P$16*((BA5^7)/(AX5/1000))^(1/4))/(AX5/1000))))","v":0},"Perda de carga dinâm. na aspiração:",null,null,null,null,{"$f":"A17","v":1},{"$f":"IF($BJ$10=2,60,IF($BJ$10=3,(1/60),IF($BJ$10=4,(1000/60),1)))","v":1},"Caudal"]
[null,null,null,null,null,null,null,null,null,{"$f":"IF(P$11=\"\",\"Coeficiente de caudal do sprinkler a utilizar :\",IF(AND(P11<>\"\",OR(A$5=1,A$5=7,A$5=11),P11>=54,P11<=60),\"Coeficiente de caudal do sprinkler DN 10 :\",IF(AND(P11<>\"\",OR(A$5=2,A$5=3,A$5=4,$A$5=5,$A$5=6,A$5=7,A$5=8,A$5=9,A$5=12,A$5=13,A$5=14,A$5=15),P11>=76,P11<=84),\"Coeficiente de caudal do sprinkler DN 15 :\",IF(AND(P11<>\"\",OR($A$5=5,$A$5=6,A$5=7,$A$5=10,$A$5=16,$A$5=17,$A$5=18),P11>=109,P11<=121),\"Coeficiente de caudal do sprinkler DN 20 :\",\"\"))))","v":"Coeficiente de caudal do sprinkler DN 15 :"},"K métrico","l/min.bar0,5",null,null,null,{"$f":"IF(M11<>\"\",M11,IF(OR(A$5=1,A$5=11),57,IF(OR(A$5=2,A$5=3,A$5=4,A$5=8,A$5=9,A$5=12,A$5=13,A$5=14,A$5=15),80,IF(OR($A$5=5,$A$5=6,$A$5=10,A$5=16,A$5=17,A$5=18),115,\"\"))))","v":80},{"$f":"IF(AND(M$11=\"\",A$5<>7),\"Assumido por defeito conforme Quadro 4\",IF(AND(M11<>\"\",A$5=1,OR(M11<54,M11>60)),\"Atenção: constante K fora de tolerância\",IF(AND(M11<>\"\",OR(A$5=2,A$5=3,A$5=4,A$5=8,A$5=9),OR(M11<76,M11>84)),\"Atenção: constante K fora de tolerância\",IF(AND(M11<>\"\",OR($A$5=5,$A$5=6,$A$5=10),OR(M11<109,M11>121)),\"Atenção: constante K fora de tolerância\",IF(AND(M11<>\"\",A$5=7,OR(M11<54,M11>121)),\"Recomenda-se um valor entre 54 e 121\",IF(AND(M11<>\"\",A$5=7),\"Valor imposto pelo utilizador\",\"\"))))))","v":"Assumido por defeito conforme Quadro 4"},null,null,null,null,null,null,null,null,null,null,null,null,null,null,null,"Perda de carga dinâmica total :","ΔPacum.total =",{"$f":"IF(AU11=\"\",\"? \"&AT11,ROUND(AU11,$BM$5)&\" \"&AT11)","v":"? kPa"},null,null,null,null,{"$f":"IF(AU15=\"\",\"\",\"Avaliação global :\")","v":""},null,null,null,null,null,{"$f":"AT9","v":"kPa"},{"$f":"IF(OR($FE$111=\"\",$FE$111=0),\"\",$FE$111)","v":""},null,null,null,null,null,null,null,null,null,null,null,null,null,null,{"$f":"A18","v":1},{"$f":"IF($BJ$11=2,100,IF($BJ$11=3,9.81,IF($BJ$11=4,98.1,1)))","v":1},"Pressão",{"$f":"IF($BJ$11=2,100/AU19,IF($BJ$11=3,1,IF($BJ$11=4,10,1/AU19)))","v":0.1019367991845056},"Pressão para m.c.a.",null,null,null,null,null,null,null,null,null,null,null,null,null,null,null,null,null,null,null,null,null,null,null,null,null,null,null,null,null,null,null,null,null,null,null,null,null,null,null,null,null,null,null,null,null,null,null,null,null,null,null,null,null,null,null,null,"Localização automática do NÓ inicial, para atribuição da Pressão Inicial e segurança de repetição do ponto INICIAL"]
[null,null,null,null,null,null,null,null,null,{"$f":"IF(Q12=\"Assumido por defeito nos ramais principais\",\"Perda de carga dinâmica admissível - EN 12845 :\",\"Perda de carga dinâmica adm. nos ramais principais :\")","v":"Perda de carga dinâmica admissível - EN 12845 :"},"ΔPacum.ad.",{"$f":"AJ24","v":"kPa"},null,null,null,{"$f":"IF(OR(M12=\"\",M12=0),50*$B$18,M12)","v":50},{"$f":"IF(M$12=\"\",\"Assumido por defeito nos ramais principais\",\"Valor imposto pelo utilizador\")","v":"Assumido por defeito nos ramais principais"},null,null,null,null,null,null,null,null,null,null,null,null,null,null,null,"Perda de carga dinâmica nos ramais principais :","ΔPacum.R.P. =",{"$f":"IF(AU12=\"\",\"? \"&AT12,ROUND(AU12,$BM$5)&\" \"&AT12)","v":"? kPa"},{"$f":"IF(OR($AU$12=\"\",$AU$12=0),\"\",IF($AU$12<=$P$12,\"\",\"N.C.\"))","v":""},null,{"$f":"IF(MAX(H25:H49)>AU6,\"Verificar Não Conformidades\",IF(AY24>=1,\"Introdução de dados em curso\",IF(OR($AU$12=\"\",$AU$12=0),\"\",IF($AJ$12=\"N.C.\",\"Valor(es) Superior(es) ao Permitido\",IF(OR($CR$50<>0,$CR$54<>0,$AS$24<>0,J21=\" Erro: L não pode ser inferior a h\"),\"Verificar Não Conformidades\",\"Dimensionamento Conforme\")))))","v":""},null,null,null,null,null,null,null,{"$f":"AT11","v":"kPa"},{"$f":"IF(OR($FD$111=\"\",$FD$111=0),\"\",$FD$111)","v":""},null,{"$f":"IF(OR(AX8=\"\",AX8=0,AX8<0),1,2)","v":1},"Modo de aspiração: positiva se = 1 ; negativa se = 2.",null,null,null,null,"Vmáx.asp.=",{"$f":"IF(AW12=1,1.8,1.5)","v":1.8},"m/s","Di mín.asp.=",{"$f":"IF(OR(MAX(W25:W49)=\"\",MAX(W25:W49)=0),\"\",IF(AW12=1,68.9,80.9))","v":""},"mm","Di mín.asp.=",{"$f":"IF(BG12=\"\",\"\",MAX(BG12,BN12))","v":""},"mm",{"$f":"IF(OR(BG12=\"\",AU15=\"\"),\"\",4.6*SQRT((AU15*1.4*$BK$10)/BD12))","v":""},{"$f":"IF(AU15=\"\",\"\",IF(BL12<='Quadro 1'!$G$10,'Quadro 1'!$G$10,IF(BL12<='Quadro 1'!$G$11,'Quadro 1'!$G$11,IF(BL12<='Quadro 1'!$G$12,'Quadro 1'!$G$12,IF(BL12<='Quadro 1'!$G$13,'Quadro 1'!$G$13,IF(BL12<='Quadro 1'!$G$14,'Quadro 1'!$G$14,IF(BL12<='Quadro 1'!$G$15,'Quadro 1'!$G$15,IF(BL12<='Quadro 1'!$G$16,'Quadro 1'!$G$16,\"\"))))))))","v":""},{"$f":"MIN(BM12,BM13)","v":0},"RGSCIE - NT nº 15.",null,null,null,null,"V p/ caudal sobrecarga =",{"$f":"IF(OR(AX5=\"\",AX5=0,AU15=0,AU15=\"\"),\"\",((AU15*1.4/(60/$BK$10))/1000)/((PI()*(AX5/1000)^2)/4))","v":""},"m/s"]
[null,null,null,null,null,null,null,null,null,{"$f":"IF(P13=6,\"Velocidade de escoamento admissível - EN 12845 :\", \"Velocidade admissível imposta pelo utilizador :\")","v":"Velocidade de escoamento admissível - EN 12845 :"},"Vadm.","m/s",null,null,null,{"$f":"IF(OR(M13=\"\",M13=0),6,M13)","v":6},{"$f":"\"Gama imposta: \"&AV23&\" ≤ V ≤ \"&AX23&\" m/s\"","v":"Gama imposta: 0,5 ≤ V ≤ 6 m/s"},null,null,null,null,null,null,null,null,null,null,null,null,null,null,null,"Diâmetro interior médio da tubagem de aço :","Di médio =",{"$f":"IF(AU13=\"\",\"? mm\",ROUND(AU13,2)&\" \"&AT13)","v":"? mm"},null,null,null,null,null,null,null,null,null,null,"mm",{"$f":"IF(EJ128=\"\",\"\",EJ128)","v":""},null,null,null,null,null,null,null,null,null,null,null,null,null,null,null,null,null,{"$f":"IF(AU15=\"\",\"\",IF(BL12<='Quadro 1'!$G$17,'Quadro 1'!$G$17,IF(BL12<='Quadro 1'!$G$18,'Quadro 1'!$G$18,IF(BL12<='Quadro 1'!$G$19,'Quadro 1'!$G$19,IF(BL12<='Quadro 1'!$G$20,'Quadro 1'!$G$20,IF(BL12<='Quadro 1'!$G$21,'Quadro 1'!$G$21,IF(BL12<='Quadro 1'!$G$22,'Quadro 1'!$G$22,IF(BL12<='Quadro 1'!$G$23,'Quadro 1'!$G$23,'Quadro 1'!$G$23))))))))","v":""},null,null,null,null,null,null,"V p/ caudal máximo =",{"$f":"IF(OR(AX5=\"\",AX5=0,AU15=0,AU15=\"\"),\"\",((AU15/(60/$BK$10))/1000)/((PI()*(AX5/1000)^2)/4))","v":""},"m/s"]
[null,null,null,null,null,null,null,null,null,"Percentagem de afectação - perdas de carga locais :","J%","%",null,null,null,{"$f":"IF(M14<>\"\",M14,IF(SUM($L$25:$L$49)=0,0.25,0))","v":0.25},"Para cálculo do comprimento equivalente",null,null,null,null,null,null,null,null,null,null,null,null,null,null,null,"Necessidade de pressão - Abastecimento :","Pi máx. =",{"$f":"IF(AU14=\"\",\"? \"&AT14,IF(AV14=\"\",ROUND(AU14,$BM$5)&\" \"&AT14,ROUND(AU14,$BM$5)&\" \"&AT14&\" [\"&ROUND(AV14,$BM$5)&\"]\"))","v":"? kPa"},null,null,null,null,null,null,null,null,null,null,{"$f":"AT12","v":"kPa"},{"$f":"IF(AU11=\"\",\"\",IF(AX10=\"\",AU9+AU11+SUMIF(D$25:D$49,\"\",K$25:K$49)*$AU$19*$B$18,AU9+AU11+SUMIF(D$25:D$49,\"\",K$25:K$49)*$AU$19*$B$18+AX10))","v":""},{"$f":"IF(AU14=\"\",\"\",IF(AND('Curvas da Instalação'!C38<>\"\",'Curvas da Instalação'!C38>0,'Curvas da Instalação'!D38>1.05*AU15),'Curvas da Instalação'!C38,\"\"))","v":""},null,null,null,null,null,null,null,null,null,null,null,null,null,null,null,null,null,null,null,null,null,null,null,null,null,null,null,null,null,null,null,null,null,null,null,null,null,null,null,null,null,null,null,null,null,null,null,null,null,null,null,null,null,null,null,null,null,null,null,null,null,null,null,null,null,null,null,null,null,null,null,null,null,null,null,{"$f":"IF(MAX(DT22:ER22)=MIN(DT22:ER22),$EE$14,IF(OR($DV14=\"erro\",$DV15=\"erro\",$DV16=\"erro\",$DV17=\"erro\"),\"\",$DU$14))","v":""},{"$f":"IF(DV14<>\"\",DV14,IF(DV15<>\"\",DV15,IF(DV16<>\"\",DV16,IF(DV17<>\"\",DV17,\"\"))))","v":""},{"$f":"IF(DW14<>\"\",DW14,IF(DX14<>\"\",DX14,IF(DY14<>\"\",DY14,IF(DZ14<>\"\",DZ14,\"\"))))","v":""},{"$f":"IF(DT18<>\"\",DT18,IF(DU18<>\"\",DU18,IF(DV18<>\"\",DV18,IF(DW18<>\"\",DW18,IF(DX18<>\"\",DX18,IF(DY18<>\"\",DY18,IF(DZ18<>\"\",DZ18,\"\")))))))","v":""},{"$f":"IF(EA18<>\"\",EA18,IF(EB18<>\"\",EB18,IF(EC18<>\"\",EC18,IF(ED18<>\"\",ED18,IF(EE18<>\"\",EE18,IF(EF18<>\"\",EF18,IF(EG18<>\"\",EG18,\"\")))))))","v":""},{"$f":"IF(EH18<>\"\",EH18,IF(EI18<>\"\",EI18,IF(EJ18<>\"\",EJ18,IF(EK18<>\"\",EK18,IF(EL18<>\"\",EL18,IF(EM18<>\"\",EM18,\"\"))))))","v":""},{"$f":"IF(EN18<>\"\",EN18,IF(EO18<>\"\",EO18,IF(EP18<>\"\",EP18,IF(EQ18<>\"\",EQ18,IF(ER18<>\"\",ER18,\"\")))))","v":""},null,{"$f":"IF($DU$14=$FG25,\"erro\",IF($DU$14=$FG26,\"erro\",IF($DU$14=$FG27,\"erro\",IF($DU$14=$FG28,\"erro\",IF($DU$14=$FG29,\"erro\",IF($DU$14=$FG30,\"erro\",IF($DU$14=$FG31,\"erro\",\"\")))))))","v":""},null,{"$f":"IF($DU$14=$FG25,$FF25,IF($DU$14=$FG26,$FF26,IF($DU$14=$FG27,$FF27,IF($DU$14=$FG28,$FF28,IF($DU$14=$FG29,$FF29,IF($DU$14=$FG30,$FF30,IF($DU$14=$FG31,$FF31,\"\")))))))","v":""},{"$f":"IF(ED14<>\"\",ED14,IF(ED15<>\"\",ED15,IF(ED16<>\"\",ED16,IF(ED17<>\"\",ED17,\"\"))))","v":""}]
[null,null,null,null,null,null,null,null,null,null,null,"Opção de dimensionamento com recurso à fórmula de Flamant (X) : ",null,null,null,{"$f":"IF(M15=\"\",\" Cálculo efectuado através da fórmula de Hazen & Williams\",\"  Cálculo efectuado através da fórmula de Flamant\")","v":" Cálculo efectuado através da fórmula de Hazen & Williams"},null,null,null,null,null,null,null,null,null,null,null,null,null,null,null,null,"Necessidade de caudal - Abastecimento :","Q máx. =",{"$f":"IF(AU15=\"\",\"? \"&AT15,IF(AV15=\"\",ROUND(AU15,$BH$5)&\" \"&AT15,ROUND(AU15,$BH$5)&\" \"&AT15&\" [\"&ROUND(AV15,$BH$5)&\"]\"))","v":"? l/min"},null,null,null,null,null,null,null,null,null,null,{"$f":"AT8","v":"l/min"},{"$f":"IF(MAX(R25:R49)=0,\"\",MAX(R25:R49))","v":""},{"$f":"IF(AU15=\"\",\"\",IF(AND('Curvas da Instalação'!D38<>\"\",'Curvas da Instalação'!D38>0,'Curvas da Instalação'!D38>1.05*AU15),'Curvas da Instalação'!D38,\"\"))","v":""},{"$f":"IF(MAX(R25:R49)=0,\"\",MAX(R25:R49))","v":""},null,null,null,null,null,null,null,null,null,null,null,null,null,null,null,null,null,null,null,null,null,null,null,null,null,null,null,null,null,null,null,null,null,null,null,null,null,null,null,null,null,null,null,null,null,null,null,null,null,null,null,null,null,null,null,null,null,null,null,null,null,null,null,null,null,null,null,null,null,null,null,null,null,null,null,null,{"$f":"IF(DW15<>\"\",DW15,IF(DX15<>\"\",DX15,IF(DY15<>\"\",DY15,IF(DZ15<>\"\",DZ15,\"\"))))","v":""},{"$f":"IF(DT19<>\"\",DT19,IF(DU19<>\"\",DU19,IF(DV19<>\"\",DV19,IF(DW19<>\"\",DW19,IF(DX19<>\"\",DX19,IF(DY19<>\"\",DY19,IF(DZ19<>\"\",DZ19,\"\")))))))","v":""},{"$f":"IF(EA19<>\"\",EA19,IF(EB19<>\"\",EB19,IF(EC19<>\"\",EC19,IF(ED19<>\"\",ED19,IF(EE19<>\"\",EE19,IF(EF19<>\"\",EF19,IF(EG19<>\"\",EG19,\"\")))))))","v":""},{"$f":"IF(EH19<>\"\",EH19,IF(EI19<>\"\",EI19,IF(EJ19<>\"\",EJ19,IF(EK19<>\"\",EK19,IF(EL19<>\"\",EL19,IF(EM19<>\"\",EM19,\"\"))))))","v":""},{"$f":"IF(EN19<>\"\",EN19,IF(EO19<>\"\",EO19,IF(EP19<>\"\",EP19,IF(EQ19<>\"\",EQ19,IF(ER19<>\"\",ER19,\"\")))))","v":""},null,{"$f":"IF($DU$14=$FG32,\"erro\",IF($DU$14=$FG33,\"erro\",IF($DU$14=$FG34,\"erro\",IF($DU$14=$FG35,\"erro\",IF($DU$14=$FG36,\"erro\",IF($DU$14=$FG37,\"erro\",IF($DU$14=$FG38,\"erro\",\"\")))))))","v":""},null,{"$f":"IF($DU$14=$FG32,$FF32,IF($DU$14=$FG33,$FF33,IF($DU$14=$FG34,$FF34,IF($DU$14=$FG35,$FF35,IF($DU$14=$FG36,$FF36,IF($DU$14=$FG37,$FF37,IF($DU$14=$FG38,$FF38,\"\")))))))","v":""}]
[null,null,null,null,null,null,null,null,null,null,"Constante de rugosidade aplicável a água fria :",{"$f":"IF(M15=\"\",\"C\",\"b\")","v":"C"},null,null,null,{"$f":"IF(AND(M15=\"\",OR(M16=\"\",M16=0,M16<100,M16>125)),ROUND(120,1),IF(AND(OR(M15=\"x\",M15<>\"\"),OR(M16=\"\",M16=0,M16<0.000185,M16>0.00028)),ROUND(0.00023,5),M16))","v":120},{"$f":"IF(AND(M15=\"\",M16<>120,M16<>\"\"),\"Atenção, utilizar: Aço Galvanizado=120 ; Aço Preto=100.\",IF(AND(M15=\"x\",M16<>0.00023,M16<>\"\"),\"Atenção, o valor a usar em tubagens de aço é 0,00023\",\"Valor típico para tubagens em aço preto / galvanizado\"))","v":"Valor típico para tubagens em aço preto / galvanizado"},null,null,null,null,null,null,null,null,null,null,null,null,null,null,null,{"$f":"IF(AJ16<>\"\",\"Potência mínima da fonte de pressão (μ=\"&AJ16*100&\"%) :\",\"Potência mínima da fonte de pressão (μ=75%) :\")","v":"Potência mínima da fonte de pressão (μ=75%) :"},"Pot mín. =",{"$f":"IF(OR(AU16=\"\",AU16=0),\"? kW\",ROUND(AU16,2)&\" \"&AT16)","v":"? kW"},null,null,null,null,null,null,null,null,null,null,"kW",{"$f":"IF(OR(AU14=\"\",AU15=\"\"),\"\",(((AU14/$B$18)*((AU15/$B$17)/60))/AV16)/1000)","v":""},{"$f":"IF(AJ$16<>\"\",AJ$16,0.75)","v":0.75},{"$f":"IF(AU16=\"\",\"\",AU16*1000/736)","v":""},{"$f":"IF(AU16=\"\",\"\",\"CV\")","v":""},null,null,null,null,null,null,null,null,null,null,null,null,null,null,null,null,null,null,null,null,null,null,null,null,null,null,null,null,null,null,null,null,null,null,null,null,null,null,null,null,null,null,null,null,null,null,null,null,null,null,null,null,null,null,null,null,null,null,null,null,null,null,null,null,null,null,null,null,null,null,null,null,null,null,null,{"$f":"IF(DW16<>\"\",DW16,IF(DX16<>\"\",DX16,IF(DY16<>\"\",DY16,IF(DZ16<>\"\",DZ16,\"\"))))","v":""},{"$f":"IF(DT20<>\"\",DT20,IF(DU20<>\"\",DU20,IF(DV20<>\"\",DV20,IF(DW20<>\"\",DW20,IF(DX20<>\"\",DX20,IF(DY20<>\"\",DY20,IF(DZ20<>\"\",DZ20,\"\")))))))","v":""},{"$f":"IF(EA20<>\"\",EA20,IF(EB20<>\"\",EB20,IF(EC20<>\"\",EC20,IF(ED20<>\"\",ED20,IF(EE20<>\"\",EE20,IF(EF20<>\"\",EF20,IF(EG20<>\"\",EG20,\"\")))))))","v":""},{"$f":"IF(EH20<>\"\",EH20,IF(EI20<>\"\",EI20,IF(EJ20<>\"\",EJ20,IF(EK20<>\"\",EK20,IF(EL20<>\"\",EL20,IF(EM20<>\"\",EM20,\"\"))))))","v":""},{"$f":"IF(EN20<>\"\",EN20,IF(EO20<>\"\",EO20,IF(EP20<>\"\",EP20,IF(EQ20<>\"\",EQ20,IF(ER20<>\"\",ER20,\"\")))))","v":""},null,{"$f":"IF($DU$14=$FG39,\"erro\",IF($DU$14=$FG40,\"erro\",IF($DU$14=$FG41,\"erro\",IF($DU$14=$FG42,\"erro\",IF($DU$14=$FG43,\"erro\",IF($DU$14=$FG44,\"erro\",\"\"))))))","v":""},null,{"$f":"IF($DU$14=$FG39,$FF39,IF($DU$14=$FG40,$FF40,IF($DU$14=$FG41,$FF41,IF($DU$14=$FG42,$FF42,IF($DU$14=$FG43,$FF43,IF($DU$14=$FG44,$FF44,\"\"))))))","v":""}]
[1,{"$f":"IF($A$17=2,(1/60),IF($BC$4=3,(60),IF($BC$4=4,(60/1000),(1))))","v":1},null,null,null,null,null,null,null,null,"Seleccionar unidades de caudal :",null,null,null,null,{"$f":"\" Caudais expressos em \"&BG4&\".\"","v":" Caudais expressos em l/min."},null,null,null,null,null,null,null,null,null,null,null,null,null,null,null,null,null,"NPSHadmissível (cs=0,5m) =",{"$f":"IF(AX8=\"\",\"? m.c.a.\",IF(AND(BC10<>\"\",AX8>0),ROUND(AU17,1)&\" m.c.a.\",\"Não Aplicável\"))","v":"Não Aplicável"},null,null,null,null,null,null,null,null,null,null,"m.c.a.",{"$f":"IF(OR(AR8=\"\",AR8<=0,BC10=\"\"),\"\",10.33-AR8-BC10*BM11-0.43-0.5)","v":""},null,null,null,null,null,null,null,null,null,null,null,null,null,null,null,null,null,null,null,null,null,null,null,null,null,null,null,null,null,null,null,null,null,null,null,null,null,null,null,null,null,null,null,null,null,null,null,null,null,null,null,null,null,null,null,null,null,null,null,null,null,null,null,null,null,null,null,null,null,null,null,null,null,null,null,null,null,null,{"$f":"IF(DW17<>\"\",DW17,IF(DX17<>\"\",DX17,IF(DY17<>\"\",DY17,IF(DZ17<>\"\",DZ17,\"\"))))","v":""},{"$f":"IF(DT21<>\"\",DT21,IF(DU21<>\"\",DU21,IF(DV21<>\"\",DV21,IF(DW21<>\"\",DW21,IF(DX21<>\"\",DX21,IF(DY21<>\"\",DY21,IF(DZ21<>\"\",DZ21,\"\")))))))","v":""},{"$f":"IF(EA21<>\"\",EA21,IF(EB21<>\"\",EB21,IF(EC21<>\"\",EC21,IF(ED21<>\"\",ED21,IF(EE21<>\"\",EE21,IF(EF21<>\"\",EF21,IF(EG21<>\"\",EG21,\"\")))))))","v":""},{"$f":"IF(EH21<>\"\",EH21,IF(EI21<>\"\",EI21,IF(EJ21<>\"\",EJ21,IF(EK21<>\"\",EK21,IF(EL21<>\"\",EL21,IF(EM21<>\"\",EM21,\"\"))))))","v":""},{"$f":"IF(EN21<>\"\",EN21,IF(EO21<>\"\",EO21,IF(EP21<>\"\",EP21,IF(EQ21<>\"\",EQ21,IF(ER21<>\"\",ER21,\"\")))))","v":""},null,{"$f":"IF($DU$14=$FG45,\"erro\",IF($DU$14=$FG46,\"erro\",IF($DU$14=$FG47,\"erro\",IF($DU$14=$FG48,\"erro\",IF($DU$14=$FG49,\"erro\",\"\")))))","v":""},null,{"$f":"IF($DU$14=$FG45,$FF45,IF($DU$14=$FG46,$FF46,IF($DU$14=$FG47,$FF47,IF($DU$14=$FG48,$FF48,IF($DU$14=$FG49,$FF49,\"\")))))","v":""},null,null,null,null,null,null,null,null,null,null,null,null,null,null,null,null,null,null,null,null,null,null,null,"Lcrítico","Leq.máx.","Jcrítica média "]
[1,{"$f":"IF($A$18=2,(1/100),IF($BJ$4=3,(1/9.81),IF($BJ$4=4,(1/98.1),1)))","v":1},null,null,null,null,null,null,null,null,"Seleccionar unidades de pressão :",null,null,null,null,{"$f":"\" Pressões expressas em \"&BL4&\".\"","v":" Pressões expressas em kPa."},null,null,null,null,null,null,null,null,null,null,null,null,null,null,null,null,{"$f":"IF('Curvas da Instalação'!D38=\"\",\"Volume do reservatório (\"&AX18&\" min.) :\",\"Volume do reservatório (\"&AX18&\" min.) :\")","v":"Volume do reservatório (60 min.) :"},"Vol.reserv.=",{"$f":"IF(AU18=0,\"? m³\",ROUND(AU18,$BH$5)&\" \"&AT18)","v":"? m³"},null,null,null,null,null,null,null,null,null,null,"m³",{"$f":"AV18/1000","v":0},{"$f":"AX18*AZ18","v":0},"litros",{"$f":"IF(AND(AJ18=\"\",B5=7),30,IF(AND(AJ18=\"\",OR(B5=1,B5=2,B5=3,B5=4,B5=5,B5=15,B5=16,B5=17,B5=18,B5=8,B5=9,B5=10,B5=11,B5=21)),60,IF(AND(AJ18=\"\",OR(B5=6,B5=19,B5=20,B5=12,B5=13,B5=14)),90,AJ18)))","v":60},"min.",{"$f":"BB18*BK10","v":0},"l/min.",{"$f":"IF(OR(AW15=\"\",AW15=0),0,IF(AND('Curvas da Instalação'!D38=\"\",'Curvas da Instalação'!D38<=1.05*AU15),AW15*1.4,MAX(AW15*1.4,'Curvas da Instalação'!D38)))","v":0},{"$f":"AT15","v":"l/min"},null,null,null,null,null,null,null,null,null,null,null,null,null,null,null,null,null,null,null,null,null,null,null,null,null,null,null,null,null,null,null,null,"Verificações da correcta introdução de dados",null,null,null,null,null,null,null,null,null,null,null,null,null,null,null,null,null,null,null,null,null,null,null,null,null,null,null,null,null,null,null,null,null,null,null,{"$f":"IF(AND(DT$22=$DS$22,DT$25<>\"\"),DT$25,IF(AND(DT$22=$DS$22,DT$26<>\"\"),DT$26,IF(AND(DT$22=$DS$22,DT$27<>\"\"),DT$27,IF(AND(DT$22=$DS$22,DT$28<>\"\"),DT$28,IF(AND(DT$22=$DS$22,DT$29<>\"\"),DT$29,IF(AND(DT$22=$DS$22,DT$30<>\"\"),DT$30,IF(AND(DT$22=$DS$22,DT$31<>\"\"),DT$31,\"\")))))))","v":""},"","","","","","","","","","","","","","","","","","","","","","","",""]
[null,null,null,null,1,2,null,3,4,5,6,7,8,"Caudal e K do",null,9,10,11,12,null,13,null,14,null,null,15,16,null,17,18,19,20,21,22,23,24,null,null,null,25,26,null,null,27,null,null,9.81,"Verificação da existência de 1 único ponto inicial",null,null,null,null,null,null,null,null,null,null,null,null,null,null,null,null,null,null,null,null,null,null,null,null,null,null,null,null,null,null,null,null,null,null,null,null,null,null,null,null,null,"2ª Verif. da correcta",null,null,"1ª Verif. da correcta",null,null,null,null,null,null,null,null,null,null,null,null,null,null,null,null,null,null,null,null,null,null,null,null,null,null,null,null,null,null,{"$f":"IF(AND(DT$22=$DS$22,DT$32<>\"\"),DT$32,IF(AND(DT$22=$DS$22,DT$33<>\"\"),DT$33,IF(AND(DT$22=$DS$22,DT$34<>\"\"),DT$34,IF(AND(DT$22=$DS$22,DT$35<>\"\"),DT$35,IF(AND(DT$22=$DS$22,DT$36<>\"\"),DT$36,IF(AND(DT$22=$DS$22,DT$37<>\"\"),DT$37,IF(AND(DT$22=$DS$22,DT$38<>\"\"),DT$38,\"\")))))))","v":""},"","","","","","","","","","","","","","","","","","","","","","","","",null,null,null,null,null,null,null,null,null,"m","m","m/m"]
[null,null,null,null,null,"0.2",null,"2.1","2.2","3.1","3.2","Quadro 2","3.4","do Sub-Ramal 1",null,"4.1","4.2","4.3","5.0",null,"5.1",null,"5.2",null,null,"Quadros 1 e 5",null,"5.5","6.1","6.2","7.1","7.2","7.3","7.4","8.1","8.2",null,null,null,"9.1","9.2",null,null,null,null,null,"Gravidade",null,null,null,null,null,null,null,null,null,null,null,null,null,null,null,null,null,null,null,null,null,null,null,null,null,null,null,null,null,null,null,null,null,null,null,null,null,null,null,null,null,null,"introdução do nº de sprinklers",null,null,"introdução do nº de sprinklers","Verif. da correcta",null,null,"Diâmetros mínimos em função do nº total de",null,null,null,null,null,null,null,null,null,null,null,null,null,null,null,null,null,null,null,null,null,null,null,null,null,null,{"$f":"IF(AND(DT$22=$DS$22,DT$39<>\"\"),DT$39,IF(AND(DT$22=$DS$22,DT$40<>\"\"),DT$40,IF(AND(DT$22=$DS$22,DT$41<>\"\"),DT$41,IF(AND(DT$22=$DS$22,DT$42<>\"\"),DT$42,IF(AND(DT$22=$DS$22,DT$43<>\"\"),DT$43,IF(AND(DT$22=$DS$22,DT$44<>\"\"),DT$44,\"\"))))))","v":""},"","","","","","","","","","","","","","","","","","","","","","","","",null,null,null,null,null,null,null,null,null,{"$f":"IF(OR($FE$24=\"\",$FE$24=0),\"\",$FE$24)","v":""},{"$f":"IF(FB20=\"\",\"\",FB20*(1+$M$14))","v":""},{"$f":"IF(OR($AU$9=\"\",$FC$20=\"\",$DT$14=\"\",$DT$14=0,$AV$24>=3),\"\",IF(((($P$12+200*$B$18)-$AU$9)/($AU$19*$B$18))/$FC$20<=0,((($P$12)/($AU$19*$B$18))/$FC$20),((($P$12+200*$B$18)-$AU$9)/($AU$19*$B$18))/$FC$20))","v":""}]
[null,null,null,null,"Codificação",null,null,"Nº de Sprinklers",null,{"$f":"IF(CQ50>=1,\" Erro: L não pode ser inferior a h\",\"Comprimentos dos troços\")","v":"Comprimentos dos troços"},null,null,null,{"$f":"IF($P$7=\"\",\"\",IF($N$22=0,1,$N$22))","v":1},"Obtidos por","Factor de","Caudais",null,"Tubo",null,"Diâmetro normalizado",null,null,null,null,null,"Designação",null,"Pressões",null,"Análise das Perdas de Carga - DP",null,null,null,null,null,null,null,null,"Análise da Velocidade",null,null,null,"Obs.",null,null,null,null,null,null,null,null,null,null,"Pi relacionada",null,null,"Pressão do Fim para Inicío",null,null,null,null,null,null,null,null,null,null,null,null,null,null,null,null,null,null,null,null,null,null,null,null,null,null,null,null,null,null,null,"garantindo que o nº de ",null,null,"no sub-ramal 1","introdução do nº de sprinklers",null,null,"sprinklers abastecidos e do nível de risco",null,null,null,null,null,null,null,null,null,null,null,null,null,null,null,null,null,null,null,null,null,null,null,null,null,null,{"$f":"IF(AND(DT$22=$DS$22,DT$45<>\"\"),DT$45,IF(AND(DT$22=$DS$22,DT$46<>\"\"),DT$46,IF(AND(DT$22=$DS$22,DT$47<>\"\"),DT$47,IF(AND(DT$22=$DS$22,DT$48<>\"\"),DT$48,IF(AND(DT$22=$DS$22,DT$49<>\"\"),DT$49,\"\")))))","v":""},"","","","","","","","","","","","","","","","","","","","","","","","",null,null,null,"Perda"]
[null,null,null,null,"dos troços",null,null,"simultâneo","total","real","altura","localizado","equivalente",{"$f":"MIN(H25:H49)","v":0},"analogia","caudal","intermédio","cálculo","material","Cálculo","imposto",null,"interior",null,null,"exterior","tubo aço EN 10255",null,"inicial","final","unitária","dinâmica","estática","total","acum.dinâm.","avaliação",null,null,null,"troço","avaliação",null,null,null,null,null,null,null,null,null,null,"Situação em que existe uma bifurcação entre o conjunto de sub-ramais de funcionamento simultâneo.",null,"Inicial","com troço crítico",null,"final","Inicial","Final","Fin.Corr.",null,null,null,null,null,null,null,null,null,null,null,null,null,null,null,null,null,null,null,null,null,null,null,null,null,null,null,null,null,"sprinklers de um troço",null,null,null,"máx. por sub-ramal","Controlo da",null,null,null,"Quadro 5",null,null,"Quadro 5",null,null,null,null,null,null,null,null,null,null,null,null,null,null,null,null,null,null,null,null,{"$f":"MIN(DT22:ER22)","v":0},{"$f":"IF(25-COUNTBLANK(DT25:DT49)=0,\"\",25-COUNTBLANK(DT25:DT49))","v":""},{"$f":"IF(25-COUNTBLANK(DU25:DU49)=0,\"\",25-COUNTBLANK(DU25:DU49))","v":""},{"$f":"IF(25-COUNTBLANK(DV25:DV49)=0,\"\",25-COUNTBLANK(DV25:DV49))","v":""},"","","","","","","","","","","","","","","","","","","","","","",null,null,null,"Carga","Pos.","Trajecto Crítico (em comprimento)",null,null,null,null,"Explicitação automática de todos os caminhos, incluindo o crítico:",null,null,null,1,5,{"$f":"FG22+1","v":2},null,null,{"$f":"FI22+1","v":3},null,null,null,{"$f":"FL22+1","v":4},null,null,null,{"$f":"FP22+1","v":5},null,null,null,{"$f":"FT22+1","v":6},null,null,null,{"$f":"FX22+1","v":7},null,null,null,{"$f":"GB22+1","v":8},null,null,null,{"$f":"GF22+1","v":9},null,null,null,{"$f":"GJ22+1","v":10},null,null,null,{"$f":"GN22+1","v":11},null,null,null,{"$f":"GR22+1","v":12},null,null,null,{"$f":"GV22+1","v":13},null,null,null,{"$f":"GZ22+1","v":14},null,null,null,{"$f":"HD22+1","v":15},null,null,null,{"$f":"HH22+1","v":16},null,null,null,{"$f":"HL22+1","v":17},null,null,null,{"$f":"HP22+1","v":18},null,null,null,{"$f":"HT22+1","v":19},null,null,null,{"$f":"HX22+1","v":20},null,null,null,{"$f":"IB22+1","v":21},null,null,null,{"$f":"IF22+1","v":22},null,null,null,{"$f":"IJ22+1","v":23},null,null,null,{"$f":"IN22+1","v":24},null,null,null,{"$f":"IR22+1","v":25}]
[null,"Troço",null,null,"N","Início","Fim","NSsim.troço","NStroço","Lreal","h1)","Leq. local","Leq.",{"$f":"SUMIF($A$25:$A$49,\"ss1\",$Q$25:$Q$49)","v":0},"Qsub-ramal","Kmétrico","QS/sub-ramal","Qtroço","Classe","Di cálculo","Di imposto","Dinterior","Di","Gama de","Gama de","D","Série Média",null,"Pi","Pf","J","ΔPdinâmica","ΔPestática","ΔPtroço","ΔPacum.R.P.","ΔPacum.R.P. ≤",null,null,{"$f":"P12","v":50},"V ",null,{"$f":"\"\"&AV23&\" ≤ V ≤\"","v":"0,5 ≤ V ≤"},{"$f":"ROUND(AX23,1)","v":6},"Freq.",null,"Valor mínimo teórico do caudal de cálculo no troço em análise",null,{"$f":"IF(U13<>\"\",U13,0.5)","v":0.5},"≤ V ≤",{"$f":"ROUND(P13,1)","v":6},"Confrmação de que os dados estão introduzidos na totalidade",null,{"$f":"IF(BA24=0,\"\",MATCH(BA24,BA25:BA49,0))","v":""},"Pi",{"$f":"IF($EW$23=\"\",\"\",$EW$23)","v":""},":Posição do troço crítico","Pf","Pi","Pf","Pfc","Miníma Pressão Final",null,null,null,null,null,null,null,null,null,null,null,null,null,null,null,null,null,null,null,null,null,null,null,null,null,"Diâmetro do troço a jusante (que tem de ser igual ou inferior ao diâmetro em análise)",null,null,"não é inferior ao do troço a jusante",null,null,{"$f":"IF(CO24=\"\",\"NA\",MATCH(CO24,H25:H49,0))","v":"NA"},{"$f":"IF(OR(CP24=\"\",CP24=0),\"NA\",MATCH(CP24,CP25:CP49,0))","v":"NA"},"Altura do","Verif.",null,null,"RGSCIE",null,null,"NFPA 13",null,"Análise de bifurcações",null,null,null,null,null,null,null,null,null,null,null,null,null,null,"Identificação",null,"Início","Fim",null,"Resumo da sequência de nós, do final para o inicío.",null,null,null,null,null,null,null,null,null,null,null,null,null,null,null,null,null,null,null,null,null,null,null,null,null,null,null,"NOMINAL",{"$f":"IF(OR(SUM($EW$25:$EW$49)=25,SUM($EW$25:$EW$49)=0),\"\",MATCH(1,EW25:EW49,0))","v":""},"Máximo comprimento",null,"Comprim. + Cota Piez.",null,null,"Determinação do Caminho Crítico",null,null,"Nó Inicial","Nó Final","Lreal","Nó antecedente",null,"Troço",null,"Nó antecedente",null,"Troço",null,"Nó antecedente",null,"Troço",null,"Nó antecedente",null,"Troço",null,"Nó antecedente",null,"Troço",null,"Nó antecedente",null,"Troço",null,"Nó antecedente",null,"Troço",null,"Nó antecedente",null,"Troço",null,"Nó antecedente",null,"Troço",null,"Nó antecedente",null,"Troço",null,"Nó antecedente",null,"Troço",null,"Nó antecedente",null,"Troço",null,"Nó antecedente",null,"Troço",null,"Nó antecedente",null,"Troço",null,"Nó antecedente",null,"Troço",null,"Nó antecedente",null,"Troço",null,"Nó antecedente",null,"Troço",null,"Nó antecedente",null,"Troço",null,"Nó antecedente",null,"Troço",null,"Nó antecedente",null,"Troço",null,"Nó antecedente",null,"Troço",null,"Nó antecedente",null,"Troço",null,"Nó antecedente",null,"Troço",null,"Nó antecedente",null,"Troço"]
[{"$f":"COUNTIF(A25:A49,\"ss1\")","v":0},"crítico",null,null,"nº",null,null,"nº","nº","m","m","m","m",{"$f":"MIN(N25:N49)","v":0},{"$f":"Q24","v":"l/min"},"l/min.bar0,5",{"$f":"AT8","v":"l/min"},{"$f":"Q24","v":"l/min"},"Aço S235","mm","mm","escolhido","mm","1/2 a 2 1/2","3 a 12\"","mm","R / NPS","DN",{"$f":"AT9","v":"kPa"},{"$f":"BE24","v":"kPa"},{"$f":"IF($BJ$4=2,\"bar/m\",IF($BJ$4=3,\"m.c.a./m\",IF($BJ$4=4,\"kg/cm²/m\",\"kPa/m\")))","v":"kPa/m"},{"$f":"AD24","v":"kPa"},{"$f":"AF24","v":"kPa"},{"$f":"AF24","v":"kPa"},{"$f":"AH24","v":"kPa"},{"$f":"AI24","v":"kPa"},null,null,null,"m/s","m/s",null,null,"n.º",{"$f":"SUM(AS25:AS49)","v":0},{"$f":"AT8","v":"l/min"},"Factor de correcção caudal intermédio",{"$f":"SUM(AV25:AV49)","v":0},"Máximo","P Inicial",{"$f":"SUM(AY25:AY49)","v":0},"Posição",{"$f":"MAX(BA25:BA49)","v":0},null,{"$f":"IF($BC$23=\"\",\"\",LOOKUP($BC$23,$DN$25:$DN$49,$FF$25:$FF$49))","v":""},"Posição",{"$f":"AC24","v":"kPa"},null,null,null,"Mínimo",1,2,3,4,5,6,7,8,9,10,11,12,13,14,15,16,17,18,19,20,21,22,23,24,25,{"$f":"IF(MAX(CI25:CI49)>0,MAX(CI25:CI49),\"\")","v":""},null,null,"Nº de sprinklers simultâneos alimentados pelo troço a jusante","Localização do troço a jusante","Troços com sprinkler no final",{"$f":"IF(MAX(CO25:CO49)>$AU$7,MAX(CO25:CO49),\"\")","v":""},{"$f":"IF(AND(MIN(CP25:CP49)<>$AU$7,MIN(CP25:CP49)<>2*$AU$7,MIN(CP25:CP49)<>3*$AU$7,MIN(CP25:CP49)<>4*$AU$7,MIN(CP25:CP49)<>5*$AU$7,MIN(CP25:CP49)<>6*$AU$7,MIN(CP25:CP49)<>7*$AU$7,MIN(CP25:CP49)<>8*$AU$7),MIN(CP25:CP49),\"\")","v":0},"Troço","Veloc.",null,"II","III, VI, VII e VIII","XII","Lig.","Ordin.","Graves","Factor de correcção dos caudais","Identificação da 1ª bifurcação a montante do troço",null,null,"Identificação dos troços com bifurcações a montante",null,null,null,null,null,null,null,null,null,"Nº","Troço crítico",null,null,null,"Localização de extremos",1,2,3,4,5,6,7,8,9,10,11,12,13,14,15,16,17,18,19,20,21,22,23,24,25,null,null,"Nº","Critério Final",null,"2º Critério",null,"1º Crtério",null,{"$f":"MAX(FB25:FB49)","v":0},"Comprimento máximo",null,{"$f":"MAX(FE25:FE49)","v":0},null,null,"m",null,null,"(m)",null,null,null,"(m)",null,null,null,"(m)",null,null,null,"(m)",null,null,null,"(m)",null,null,null,"(m)",null,null,null,"(m)",null,null,null,"(m)",null,null,null,"(m)",null,null,null,"(m)",null,null,null,"(m)",null,null,null,"(m)",null,null,null,"(m)",null,null,null,"(m)",null,null,null,"(m)",null,null,null,"(m)",null,null,null,"(m)",null,null,null,"(m)",null,null,null,"(m)",null,null,null,"(m)",null,null,null,"(m)",null,null,null,"(m)",null,null,null,"(m)",null,null,null,"(m)"]
[{"$f":"IF(AND(D25=\"s\",OR(B25=\"c\",B25=\"nc1\")),\"ss1\",\"\")","v":""},{"$f":"DO25","v":""},{"$f":"IF(AND(H25<=$AU$7,LEN(F25)>1,LEFT(F25,1)=\"s\",OR(RIGHT(F25,1)=\"0\",RIGHT(F25,1)=\"1\",RIGHT(F25,1)=\"2\",RIGHT(F25,1)=\"3\",RIGHT(F25,1)=\"4\",RIGHT(F25,1)=\"5\",RIGHT(F25,1)=\"6\",RIGHT(F25,1)=\"7\",RIGHT(F25,1)=\"8\",RIGHT(F25,1)=\"9\")),\"s\",\"\")","v":""},{"$f":"IF(AND(H25<=$AU$7,LEN(G25)>1,LEFT(G25,1)=\"s\",OR(RIGHT(G25,1)=\"0\",RIGHT(G25,1)=\"1\",RIGHT(G25,1)=\"2\",RIGHT(G25,1)=\"3\",RIGHT(G25,1)=\"4\",RIGHT(G25,1)=\"5\",RIGHT(G25,1)=\"6\",RIGHT(G25,1)=\"7\",RIGHT(G25,1)=\"8\",RIGHT(G25,1)=\"9\")),\"s\",\"\")","v":""},{"$f":"IF(DO54=\"\",\"\",SUM($DO$54:DO54))","v":""},null,null,null,null,null,null,{"$f":"IF('Quadro 2'!G13=\"\",\"\",'Quadro 2'!G13)","v":""},{"$f":"IF(J25=\"\",\"\",IF(L25=\"\",ABS(J25)*(1+$P$14),ABS(J25)+L25))","v":""},{"$f":"IF(OR(F25=\"\",G25=\"\",$P$7=\"\",H25=\"\",M25=\"\",$DJ$52=\"\"),\"\",IF(H25>$AU$7,\"\",IF(AND(H25<$AU$7,D25=\"s\"),\"\",IF(AND(H25<=$AU$7,B25=\"nc\"),\"\",IF(AND(AD25>0,H25=$AU$7,OR(A25=\"ss1\",C25=\"s\",D25<>\"s\")),(R25/$B$17)/SQRT(AD25*(1/100)*(1/$B$18)),IF(AND(AC25>0,H25=$AU$7,D25=\"s\"),(R25/$B$17)/SQRT(AC25*(1/100)*(1/$B$18)),\"\"))))))","v":""},{"$f":"IFERROR(IF(OR(F25=\"\",G25=\"\",H25=\"\",$AU$8=\"\",$AU$9=\"\",$DJ$52=\"\"),\"\",IF(AND($EV$53<>\"\",D25<>\"s\",B25=\"nc\",CEILING(H25/$AU$7,1)<=$BB$115),VLOOKUP(CEILING(H25/$AU$7,1),$BB$116:$BC$124,2,FALSE),\"\")),\"\")","v":""},{"$f":"IFERROR(IF(OR(H25=\"\",M25=\"\",$AU$8=\"\",$DJ$52=\"\"),\"\",IF(AND(H25<=$AU$7,D25=\"s\"),$P$11,$N$24)),\"\")","v":""},{"$f":"IFERROR(IF(OR(F25=\"\",G25=\"\",H25=\"\",H25=0,M25=\"\",$AU$8=\"\",$AU$9=\"\",$DJ$52=\"\",$A$24=0),\"\",IF(AND(H25=$N$21,D25=\"s\",DO25=\"c\"),$AU$8,IF(AND(D25=\"s\",DO25=\"c\",H25>=$AU$85,H25<=$AU$84,H25<=$AU$7),LOOKUP(H25,$AU$85:$AU$93,$AW$85:$AW$93),IF(AND(D25=\"s\",$AJ$6<>\"x\",OR(DO25=\"nc1\",DO25=\"nc2\"),$AZ$84<>\"\",$AZ$84<>0,H25<=$AZ$84),IFERROR(VLOOKUP(H25,$AY$85:$AZ$93,2,FALSE)*CZ25,\"\"),IF(AND(D25=\"s\",OR(DO25=\"nc1\",DO25=\"nc\"),H25>=$AU$85,H25<=$AU$84,H25<=$AU$7),LOOKUP(H25,$AU$85:$AU$93,$AW$85:$AW$93)*CZ25,IF(OR(AND(H25<$AU$7,D25=\"s\"),AND($BF54=1,$AT$116=\"\"),AND($BF54=1,H25<$AU$6)),$B$17*AU25*$P25*SQRT(AD25*(1/$B$18)*(1/100)),O25)))))),\"\")","v":""},{"$f":"IF(OR(M25=\"\",$AU$8=\"\",$AU$9=\"\",$DJ$52=\"\"),\"\",IF(AND(H25=1,D25=\"s\",DO25=\"c\"),$AU$8,IFERROR(IF(OR(EX54=\"\",EX54=0,EX54<H25*$AU$8),H25*$AU$8,EX54),H25*$AU$8)))","v":""},{"$f":"IF(OR(R25=\"\",R25=0),\"\",\"Aço\")","v":""},{"$f":"IF(OR(R25=\"\",M25=\"\",$FD$20=\"\",$FD$20=0),\"\",IF($M$15=\"\",ROUND((61.7*100000*((R25/$B$17)^1.85/($P$16^1.85*$FD$20)))^(1/4.87),1),ROUND(((4^11*$P$16^4*((R25/$B$17/60)*0.001)^7)/(PI()^7*$FD$20^4))^(1/19)*1000,1)))","v":""},null,{"$f":"IF(E25=\"\",\"\",IF($U25<>\"\",$U25,IF(AND($A$5>=1,$A$5<=7,MAX($CW25:$CY25)=0),T25,IF(AND($A$5>=1,$A$5<=7),MAX($CW25:$CY25),IF(AND($A$5>=11,$A$5<=18),MAX($CT55:$CV55),IF($A$5=8,$CT25,IF($A$5=9,$CU25,IF($A$5=10,$CV25,T25))))))))","v":""},{"$f":"IF(OR(H25=\"\",V25=\"\",V25=0),\"\",IF($V25>'Quadro 1'!$G$23,'Quadro 1'!$G$23,IF($V25<'Quadro 1'!$G$10,'Quadro 1'!$G$10,MIN($X25,$Y25))))","v":""},{"$f":"IF($V25<='Quadro 1'!$G$10,'Quadro 1'!$G$10,IF($V25<='Quadro 1'!$G$11,'Quadro 1'!$G$11,IF($V25<='Quadro 1'!$G$12,'Quadro 1'!$G$12,IF($V25<='Quadro 1'!$G$13,'Quadro 1'!$G$13,IF($V25<='Quadro 1'!$G$14,'Quadro 1'!$G$14,IF($V25<='Quadro 1'!$G$15,'Quadro 1'!$G$15,IF($V25<='Quadro 1'!$G$16,'Quadro 1'!$G$16,\"\")))))))","v":""},{"$f":"IF(OR(V25=\"\",V25=0),\"\",IF($V25<='Quadro 1'!$G$17,'Quadro 1'!$G$17,IF($V25<='Quadro 1'!$G$18,'Quadro 1'!$G$18,IF($V25<='Quadro 1'!$G$19,'Quadro 1'!$G$19,IF($V25<='Quadro 1'!$G$20,'Quadro 1'!$G$20,IF($V25<='Quadro 1'!$G$21,'Quadro 1'!$G$21,IF($V25<='Quadro 1'!$G$22,'Quadro 1'!$G$22,IF($V25<='Quadro 1'!$G$23,'Quadro 1'!$G$23,'Quadro 1'!$G$23))))))))","v":""},{"$f":"IF(W25=\"\",\"\",LOOKUP(W25,'Quadro 1'!$G$9:$G$23,'Quadro 1'!$H$9:$H$23))","v":""},{"$f":"IF(W25=\"\",\"\",LOOKUP(W25,'Quadro 1'!$G$9:$G$23,'Quadro 1'!$D$9:$D$23))","v":""},{"$f":"IF(W25=\"\",\"\",LOOKUP(W25,'Quadro 1'!$G$9:$G$23,'Quadro 1'!$E$9:$E$23))","v":""},{"$f":"IFERROR(IF(OR($G25=\"\",$DJ$52=\"\"),\"\",IF(AND(BF25=\"\",AW25<>\"\"),AW25,IF(AND(BF25=\"\",AW25=\"\"),AT54,BF25))),\"\")","v":""},{"$f":"IFERROR(IF(OR($G25=\"\",H25=0,$DJ$52=\"\"),\"\",IF(BH25=0,(BE25-K25*$AU$19*$B$18),BH25)),\"\")","v":""},{"$f":"IFERROR(IF(OR($P$16=\"\",R25=\"\",AN25=\"\",W25=\"\"),\"\",IF($M$15=\"\",$B$18*$AU$19*61.7*100000*((R25/$B$17)^1.85/($P$16^1.85*W25^4.87)),$B$18*$AU$19*((4*$P$16*((AN25^7)/(W25/1000))^(1/4))/(W25/1000)))),\"\")","v":""},{"$f":"IF(OR(M25=\"\",AE25=\"\"),\"\",ABS(M25*AE25))","v":""},{"$f":"IF(OR($G25=\"\",H25=0,$K25=\"\"),\"\",K25*$AU$19*$B$18)","v":""},{"$f":"IF(OR(AC25=\"\",AC25=0,AD25=\"\",AD25=0),\"\",(AC25-AD25))","v":""},{"$f":"IF(OR(AH25=\"\",$AU$8=\"\",$DJ$52=\"\"),\"\",IF($D25=\"s\",\"\",FD112))","v":""},{"$f":"IF(OR($AU$8=\"\",AE25=\"\"),\"\",IF(AND(D25<>\"s\",AI25=\"\"),\"\",IF(BE25=0,\"Redimensionar\",IF(D25=\"s\",\"Não aplicável\",IF(AI25<$AM$23,\"Conforme\",\"Redimensionar\")))))","v":""},null,null,null,{"$f":"IF(OR(R25=\"\",W25=\"\"),\"\",(66.7*R25/$B$17)/(PI()*W25^2))","v":""},{"$f":"IF(AN25=\"\",\"\",IF(AND($AN25>=$U$13,$AN25<=$P$13),\"Conforme\",\"Redimensionar\"))","v":""},null,null,null,{"$f":"IF(AT25=\"\",0,IF(R25<AT25,1,0))","v":0},{"$f":"IF(OR(H25=\"\",R25=\"\",R25=0),0,H25*$AU$8)","v":0},{"$f":"IF(AT130=\"\",AU130,IF(OR(AT130<>0,AT130<>1),AT130,AU130))","v":1},{"$f":"IF(F25=\"\",\"\",IF(F25=$DT$14,1,0))","v":""},{"$f":"IF(BF25<>\"\",BF25,IF(MAX(AX25,BB25,BC25)=0,\"\",MAX(AX25,BB25,BC25)))","v":""},{"$f":"IF($F25=\"\",\"\",IF($F25=$G$25,$AD$25,IF($F25=$G$26,$AD$26,IF($F25=$G$27,$AD$27,IF($F25=$G$28,$AD$28,IF($F25=$G$29,$AD$29,IF($F25=$G$30,$AD$30,IF($F25=$G$31,$AD$31,IF($F25=$G$32,$AD$32,IF($F25=$G$33,$AD$33,IF($F25=$G$34,$AD$34,IF($F25=$G$35,$AD$35,IF($F25=$G$36,$AD$36,IF($F25=$G$37,$AD$37,IF($F25=$G$38,$AD$38,IF($F25=$G$39,$AD$39,IF($F25=$G$40,$AD$40,IF($F25=$G$41,$AD$41,IF($F25=$G$42,$AD$42,IF($F25=$G$43,$AD$43,IF($F25=$G$44,$AD$44,IF($F25=$G$45,$AD$45,IF($F25=$G$46,$AD$46,IF($F25=$G$47,$AD$47,IF($F25=$G$48,$AD$48,IF($F25=$G$49,$AD$49,\"\"))))))))))))))))))))))))))","v":""},{"$f":"IF(AND(A25=\"\",B25=\"\"),\"\",IF(AND(OR(A25<>\"\",B25<>\"\"),OR(F25=\"\",G25=\"\",H25=\"\",I25=\"\",J25=\"\")),1,IF(OR($A$24<$AU$7,AND(MAX($H$25:$H$49)<$P$8,MAX($H$25:$H$49)<$AU$6)),1,\"\")))","v":""},{"$f":"IF(AND(FF25=$EV$53,B25=\"c\"),$BA$23,IF(AND(FF25=$EV$53,B25=\"nc\"),$BA$23,BD25))","v":1},{"$f":"IF(AND(FF25=$EV$53,B25=\"c\"),BD25,IF(AND(FF25=$EV$53,B25=\"nc\"),\"\",\"\"))","v":""},{"$f":"IF(BD25=\"\",\"\",LOOKUP(BD25,$DN$25:$DN$49,$BF$25:$BF$49))","v":""},{"$f":"IF($BC$23=\"\",\"\",IF(FF25=$BC$24,LOOKUP($BC$23,$DN$25:$DN$49,$BF$25:$BF$49),\"\"))","v":""},{"$f":"IF(OR($FF25=\"\",COUNTIF($FF$25:$FF$49,$FF25)=0),\"\",MATCH($FF25,$FF$25:$FF$49,0))","v":1},{"$f":"IFERROR(IF(OR($G25=\"\",H25=0),\"\",IF(V25=\"\",0,IF(AND(BG25=\"\",AF25<>\"\",AC25<>\"\"),(AC25-AF25),BG25))),\"\")","v":""},{"$f":"IF(OR($G25=\"\",$BG25=\"\",$AF25=\"\"),\"\",$BG25+$AF25)","v":""},{"$f":"IF(OR($G25=\"\",$BH25=\"\",$BH25=0),\"\",IF(($BH25+$B$18*$AU$19*$K25)>=0,$BH25+$B$18*$AU$19*$K25,0))","v":""},{"$f":"IF($AU$9=\"\",\"\",IF(AND($EV25=\"crítico\",$EU25=$EW$23),$AU$9,IF(BI25>0,BI25,0)))","v":0},{"$f":"MIN(BJ25:CH25)","v":0},{"$f":"IF($G25=\"\",\"\",IF($G25=$F$25,$BF$25,\"\"))","v":""},{"$f":"IF($G25=\"\",\"\",IF($G25=$F$26,$BF$26,\"\"))","v":""},{"$f":"IF($G25=\"\",\"\",IF($G25=$F$27,$BF$27,\"\"))","v":""},{"$f":"IF($G25=\"\",\"\",IF($G25=$F$28,$BF$28,\"\"))","v":""},{"$f":"IF($G25=\"\",\"\",IF($G25=$F$29,$BF$29,\"\"))","v":""},{"$f":"IF($G25=\"\",\"\",IF($G25=$F$30,$BF$30,\"\"))","v":""},{"$f":"IF($G25=\"\",\"\",IF($G25=$F$31,$BF$31,\"\"))","v":""},{"$f":"IF($G25=\"\",\"\",IF($G25=$F$32,$BF$32,\"\"))","v":""},{"$f":"IF($G25=\"\",\"\",IF($G25=$F$33,$BF$33,\"\"))","v":""},{"$f":"IF($G25=\"\",\"\",IF($G25=$F$34,$BF$34,\"\"))","v":""},{"$f":"IF($G25=\"\",\"\",IF($G25=$F$35,$BF$35,\"\"))","v":""},{"$f":"IF($G25=\"\",\"\",IF($G25=$F$36,$BF$36,\"\"))","v":""},{"$f":"IF($G25=\"\",\"\",IF($G25=$F$37,$BF$37,\"\"))","v":""},{"$f":"IF($G25=\"\",\"\",IF($G25=$F$38,$BF$38,\"\"))","v":""},{"$f":"IF($G25=\"\",\"\",IF($G25=$F$39,$BF$39,\"\"))","v":""},{"$f":"IF($G25=\"\",\"\",IF($G25=$F$40,$BF$40,\"\"))","v":""},{"$f":"IF($G25=\"\",\"\",IF($G25=$F$41,$BF$41,\"\"))","v":""},{"$f":"IF($G25=\"\",\"\",IF($G25=$F$42,$BF$42,\"\"))","v":""},{"$f":"IF($G25=\"\",\"\",IF($G25=$F$43,$BF$43,\"\"))","v":""},{"$f":"IF($G25=\"\",\"\",IF($G25=$F$44,$BF$44,\"\"))","v":""},{"$f":"IF($G25=\"\",\"\",IF($G25=$F$45,$BF$45,\"\"))","v":""},{"$f":"IF($G25=\"\",\"\",IF($G25=$F$46,$BF$46,\"\"))","v":""},{"$f":"IF($G25=\"\",\"\",IF($G25=$F$47,$BF$47,\"\"))","v":""},{"$f":"IF($G25=\"\",\"\",IF($G25=$F$48,$BF$48,\"\"))","v":""},{"$f":"IF($G25=\"\",\"\",IF($G25=$F$49,$BF$49,\"\"))","v":""},{"$f":"IF(OR(W25=\"\",CM25=\"\",CJ25=0),\"0\",IF(W25<CJ25,1,\"0\"))","v":"0"},{"$f":"IF(OR(I25=\"\",CM25=\"\"),0,IF(LOOKUP(CM25,$EU$25:$EU$49,$W$25:$W$49)=\"\",0,LOOKUP(CM25,$EU$25:$EU$49,$W$25:$W$49)))","v":0},{"$f":"IF(OR(H25=\"\",CM25=\"\"),\"NA\",IF(H25<CL25,E25,\"NA\"))","v":"NA"},{"$f":"IF(CM25=\"\",\"\",LOOKUP(CM25,$EU$25:$EU$49,$H$25:$H$49))","v":""},{"$f":"IF(OR(DT25=\"\",DS25=1),\"\",IFERROR(MATCH(DT25,$FF$25:$FF$49,0),\"\"))","v":""},{"$f":"IF(AND(LEFT(G25,1)=\"s\",OR(RIGHT(G25,1)=\"0\",RIGHT(G25,1)=\"1\",RIGHT(G25,1)=\"2\",RIGHT(G25,1)=\"3\",RIGHT(G25,1)=\"4\",RIGHT(G25,1)=\"5\",RIGHT(G25,1)=\"6\",RIGHT(G25,1)=\"7\",RIGHT(G25,1)=\"8\",RIGHT(G25,1)=\"9\"),LEN(G25)>1),\"s\",\"\")","v":""},{"$f":"IF(OR(G25=$FB$80,G25=$FB$81,G25=$FB$82,G25=$FB$83,G25=$FB$84,G25=$FB$85,G25=$FB$86,G25=$FB$87,G25=$FB$88,G25=$FB$89),\"\",IF(AND($E25<>\"\",$CN25=\"s\"),$H25,\"\"))","v":""},{"$f":"IF(OR(AND($E25<>\"\",$CN25=\"\"),AND(F25=$FB$80,H25=$AU$7)),$H25,\"\")","v":""},{"$f":"IF(OR(K25=\"\",ABS(K25)<=J25),\"\",1)","v":""},{"$f":"IF(OR(AO25=\"\",AO25=\"Conforme\",AO25=\"Não aplicável\"),0,1)","v":0},{"$f":"IF(OR(AND($A$5<1,$A$5>18),$E25=\"\"),\"\",IF(AND($I25=\"\",$H25=\"\"),\"\",IF($I25=\"\",$H25,I25)))","v":""},{"$f":"IF($CS25<=2,27.3,IF($CS25<=3,36,IF($CS25<=5,41.9,IF($CS25<=10,53.1,IF($CS25<=20,68.9,IF($CS25<=30,80.9,IF($CS25<=40,105.3,IF($CS25<=60,129.7,155.1))))))))","v":155.1},{"$f":"IF($CS25<=2,27.3,IF($CS25<=3,36,IF($CS25<=5,41.9,IF($CS25<=10,53.1,IF($CS25<=20,68.9,IF($CS25<=30,80.9,IF($CS25<=40,105.3,IF($CS25<=60,129.7,155.1))))))))","v":155.1},{"$f":"IF($CS25=1,27.3,IF($CS25<=2,36,IF($CS25<=3,41.9,IF($CS25<=5,53.1,IF($CS25<=8,68.9,IF($CS25<=15,80.9,IF($CS25<=30,105.3,IF($CS25<=40,129.7,155.1))))))))","v":155.1},{"$f":"IF(OR($A$5<>1,$E25=\"\"),\"\",IF($CS25<=2,27.3,IF($CS25<=3,36,IF($CS25<=5,41.9,IF($CS25<=10,53.1,IF($CS25<=30,68.9,IF($CS25<=60,80.9,IF($CS25<=100,105.3,129.7))))))))","v":""},{"$f":"IF(OR(AND($A$5<>2,$A$5<>3,$A$5<>4),$E25=\"\"),\"\",IF($CS25<=2,27.3,IF($CS25<=3,36,IF($CS25<=5,41.9,IF($CS25<=10,53.1,IF($CS25<=20,68.9,IF($CS25<=40,80.9,IF($CS25<=100,105.3,129.7))))))))","v":""},{"$f":"IF(OR(AND($A$5<>5,$A$5<>6,$A$5<>7),$E25=\"\"),\"\",IF($CS25<=1,27.3,IF($CS25<=2,36,IF($CS25<=5,41.9,IF($CS25<=8,53.1,IF($CS25<=15,68.9,IF($CS25<=27,80.9,IF($CS25<=55,105.3,129.7))))))))","v":""},{"$f":"IF(OR(DO25=\"c\",DO25=\"nc1\",D25=\"\"),1,IF(DA25=\"\",1,IF(AND(DA25<>$BI$115,DA25<>$BI$116,DA25<>$BI$117,DA25<>$BI$118,DA25<>$BI$119,DA25<>$BI$120,DA25<>$BI$121,DA25<>$BI$122,OR(BK115=\"\",BK115=0)),LOOKUP(MATCH(DA25,$AU$102:$AU$111,0),$AZ$102:$AZ$111,$AX$102:$AX$111),$BK115)))","v":1},{"$f":"IF(DB25<>\"\",DB25,IF(DC25<>\"\",DC25,\"\"))","v":""},{"$f":"IF(DD25<>\"\",DD25,IF(DE25<>\"\",DE25,IF(DF25<>\"\",DF25,IF(DG25<>\"\",DG25,IF(DH25<>\"\",DH25,IF(DI25<>\"\",DI25,IF(DJ25<>\"\",DJ25,\"\")))))))","v":""},{"$f":"IF(DK25<>\"\",DK25,IF(DL25<>\"\",DL25,IF(DM25<>\"\",DM25,\"\")))","v":""},{"$f":"IF(OR($DT25=\"\",$AU$102=\"\",COUNTIF($DT25:$ER25,$AU$102)=0),\"\",LOOKUP(MATCH($AU$102,$DT25:$ER25,0),$DT$24:$ER$24,$DT25:$ER25))","v":""},{"$f":"IF(OR($DT25=\"\",$AU$103=\"\",COUNTIF($DT25:$ER25,$AU$103)=0),\"\",LOOKUP(MATCH($AU$103,$DT25:$ER25,0),$DT$24:$ER$24,$DT25:$ER25))","v":""},{"$f":"IF(OR($DT25=\"\",$AU$104=\"\",COUNTIF($DT25:$ER25,$AU$104)=0),\"\",LOOKUP(MATCH($AU$104,$DT25:$ER25,0),$DT$24:$ER$24,$DT25:$ER25))","v":""},{"$f":"IF(OR($DT25=\"\",$AU$105=\"\",COUNTIF($DT25:$ER25,$AU$105)=0),\"\",LOOKUP(MATCH($AU$105,$DT25:$ER25,0),$DT$24:$ER$24,$DT25:$ER25))","v":""},{"$f":"IF(OR($DT25=\"\",$AU$106=\"\",COUNTIF($DT25:$ER25,$AU$106)=0),\"\",LOOKUP(MATCH($AU$106,$DT25:$ER25,0),$DT$24:$ER$24,$DT25:$ER25))","v":""},{"$f":"IF(OR($DT25=\"\",$AU$107=\"\",COUNTIF($DT25:$ER25,$AU$107)=0),\"\",LOOKUP(MATCH($AU$107,$DT25:$ER25,0),$DT$24:$ER$24,$DT25:$ER25))","v":""},{"$f":"IF(OR($DT25=\"\",$AU$108=\"\",COUNTIF($DT25:$ER25,$AU$108)=0),\"\",LOOKUP(MATCH($AU$108,$DT25:$ER25,0),$DT$24:$ER$24,$DT25:$ER25))","v":""},{"$f":"IF(OR($DT25=\"\",$AU$109=\"\",COUNTIF($DT25:$ER25,$AU$109)=0),\"\",LOOKUP(MATCH($AU$109,$DT25:$ER25,0),$DT$24:$ER$24,$DT25:$ER25))","v":""},{"$f":"IF(OR($DT25=\"\",$AU$110=\"\",COUNTIF($DT25:$ER25,$AU$110)=0),\"\",LOOKUP(MATCH($AU$110,$DT25:$ER25,0),$DT$24:$ER$24,$DT25:$ER25))","v":""},{"$f":"IF(OR($DT25=\"\",$AU$111=\"\",COUNTIF($DT25:$ER25,$AU$111)=0),\"\",LOOKUP(MATCH($AU$111,$DT25:$ER25,0),$DT$24:$ER$24,$DT25:$ER25))","v":""},1,{"$f":"IF(DP25=\"\",\"\",IF(DP25>=1,\"c\",IF(AND($AX$52<$AU$7,DA25=$FB$53),\"nc1\",IF(AND(D25=\"s\",H25<>I25,$AJ$6<>\"x\"),\"nc2\",\"nc\"))))","v":""},{"$f":"IF(DT25=\"\",\"\",COUNTIF($DT$9:$ER$9,DT25))","v":""},{"$f":"IF(F25<>\"\",F25,\"\")","v":""},{"$f":"IF(G25<>\"\",G25,\"\")","v":""},{"$f":"IF(OR(DT25=\"\",DT25=0),\"\",COUNTIF($DT$25:$ER$49,DT25))","v":""},{"$f":"IF(FG25=0,\"\",FG25)","v":""},{"$f":"FI25","v":""},{"$f":"FM25","v":""},{"$f":"FQ25","v":""},{"$f":"FU25","v":""},{"$f":"FY25","v":""},{"$f":"GC25","v":""},{"$f":"GG25","v":""},{"$f":"GK25","v":""},{"$f":"GO25","v":""},{"$f":"GS25","v":""},{"$f":"GW25","v":""},{"$f":"HA25","v":""},{"$f":"HE25","v":""},{"$f":"HI25","v":""},{"$f":"HM25","v":""},{"$f":"HQ25","v":""},{"$f":"HU25","v":""},{"$f":"HY25","v":""},{"$f":"IC25","v":""},{"$f":"IG25","v":""},{"$f":"IK25","v":""},{"$f":"IO25","v":""},{"$f":"IS25","v":""},{"$f":"IW25","v":""},null,null,1,{"$f":"IF(ER170=\"\",\"\",ER170)","v":"Crítico"},{"$f":"IF(ES170=\"\",\"\",ES170)","v":1},{"$f":"IF($FA$50=1,EZ25,IF(AND(EZ25=\"Crítico\",$FA$50>1,FE83=$FE$82),\"Crítico\",FC25))","v":"Crítico"},{"$f":"IF(EX25=\"\",\"\",1)","v":1},{"$f":"IF(FB25=\"\",\"\",IF(FB25=$FB$24,\"Crítico\",\"\"))","v":"Crítico"},{"$f":"IF(EZ25=\"\",\"\",1)","v":1},{"$f":"FE25+FE83","v":0},{"$f":"IF(OR(FE25=\"\",FE25=0),\"\",IF(FE25=$FE$24,\"Crítico\",\"\"))","v":""},{"$f":"IF(FC25=\"\",\"\",1)","v":""},{"$f":"FH25+FK25+FO25+FS25+FW25+GA25+GE25+GI25+GM25+GQ25+GU25+GY25+HC25+HG25+HK25+HO25+HS25+HW25+IA25+IE25+II25+IM25+IQ25+IU25+IY25","v":0},{"$f":"F25","v":0},{"$f":"G25","v":0},{"$f":"IF(OR($J25=\"\",$J25=0,$FG25=\"\"),0,$J25)","v":0},{"$f":"IF(FG25=0,\"\",FF25)","v":""},{"$f":"IF(OR(FI25=0,COUNTIF($FG$25:$FG$49,FI25)=0),\"\",MATCH(FI25,$FG$25:$FG$49,0))","v":""},{"$f":"IF(FJ25=\"\",0,LOOKUP(FJ25,$EU$25:$EU$49,$FH$25:$FH$49))","v":0},{"$f":"IF(OR(FI25=\"\",COUNTIF($FG$25:$FG$49,FI25)=0),\"\",MATCH(FI25,$FG$25:$FG$49,0))","v":""},{"$f":"IF(FL25=\"\",\"\",LOOKUP(FL25,$EU$25:$EU$49,$FF$25:$FF$49))","v":""},{"$f":"IF(OR(FM25=0,COUNTIF($FG$25:$FG$49,FM25)=0),\"\",MATCH(FM25,$FG$25:$FG$49,0))","v":""},{"$f":"IF(FN25=\"\",0,LOOKUP(FN25,$EU$25:$EU$49,$FH$25:$FH$49))","v":0},{"$f":"IF(OR(FM25=\"\",COUNTIF($FG$25:$FG$49,FM25)=0),\"\",MATCH(FM25,$FG$25:$FG$49,0))","v":""},{"$f":"IF(FP25=\"\",\"\",LOOKUP(FP25,$EU$25:$EU$49,$FF$25:$FF$49))","v":""},{"$f":"IF(OR(FQ25=0,COUNTIF($FG$25:$FG$49,FQ25)=0),\"\",MATCH(FQ25,$FG$25:$FG$49,0))","v":""},{"$f":"IF(FR25=\"\",0,LOOKUP(FR25,$EU$25:$EU$49,$FH$25:$FH$49))","v":0},{"$f":"IF(OR(FQ25=\"\",COUNTIF($FG$25:$FG$49,FQ25)=0),\"\",MATCH(FQ25,$FG$25:$FG$49,0))","v":""},{"$f":"IF(FT25=\"\",\"\",LOOKUP(FT25,$EU$25:$EU$49,$FF$25:$FF$49))","v":""},{"$f":"IF(OR(FU25=0,COUNTIF($FG$25:$FG$49,FU25)=0),\"\",MATCH(FU25,$FG$25:$FG$49,0))","v":""},{"$f":"IF(FV25=\"\",0,LOOKUP(FV25,$EU$25:$EU$49,$FH$25:$FH$49))","v":0},{"$f":"IF(OR(FU25=\"\",COUNTIF($FG$25:$FG$49,FU25)=0),\"\",MATCH(FU25,$FG$25:$FG$49,0))","v":""},{"$f":"IF(FX25=\"\",\"\",LOOKUP(FX25,$EU$25:$EU$49,$FF$25:$FF$49))","v":""},{"$f":"IF(OR(FY25=0,COUNTIF($FG$25:$FG$49,FY25)=0),\"\",MATCH(FY25,$FG$25:$FG$49,0))","v":""},{"$f":"IF(FZ25=\"\",0,LOOKUP(FZ25,$EU$25:$EU$49,$FH$25:$FH$49))","v":0},{"$f":"IF(OR(FY25=\"\",COUNTIF($FG$25:$FG$49,FY25)=0),\"\",MATCH(FY25,$FG$25:$FG$49,0))","v":""},{"$f":"IF(GB25=\"\",\"\",LOOKUP(GB25,$EU$25:$EU$49,$FF$25:$FF$49))","v":""},{"$f":"IF(OR(GC25=0,COUNTIF($FG$25:$FG$49,GC25)=0),\"\",MATCH(GC25,$FG$25:$FG$49,0))","v":""},{"$f":"IF(GD25=\"\",0,LOOKUP(GD25,$EU$25:$EU$49,$FH$25:$FH$49))","v":0},{"$f":"IF(OR(GC25=\"\",COUNTIF($FG$25:$FG$49,GC25)=0),\"\",MATCH(GC25,$FG$25:$FG$49,0))","v":""},{"$f":"IF(GF25=\"\",\"\",LOOKUP(GF25,$EU$25:$EU$49,$FF$25:$FF$49))","v":""},{"$f":"IF(OR(GG25=0,COUNTIF($FG$25:$FG$49,GG25)=0),\"\",MATCH(GG25,$FG$25:$FG$49,0))","v":""},{"$f":"IF(GH25=\"\",0,LOOKUP(GH25,$EU$25:$EU$49,$FH$25:$FH$49))","v":0},{"$f":"IF(OR(GG25=\"\",COUNTIF($FG$25:$FG$49,GG25)=0),\"\",MATCH(GG25,$FG$25:$FG$49,0))","v":""},{"$f":"IF(GJ25=\"\",\"\",LOOKUP(GJ25,$EU$25:$EU$49,$FF$25:$FF$49))","v":""},{"$f":"IF(OR(GK25=0,COUNTIF($FG$25:$FG$49,GK25)=0),\"\",MATCH(GK25,$FG$25:$FG$49,0))","v":""},{"$f":"IF(GL25=\"\",0,LOOKUP(GL25,$EU$25:$EU$49,$FH$25:$FH$49))","v":0},{"$f":"IF(OR(GK25=\"\",COUNTIF($FG$25:$FG$49,GK25)=0),\"\",MATCH(GK25,$FG$25:$FG$49,0))","v":""},{"$f":"IF(GN25=\"\",\"\",LOOKUP(GN25,$EU$25:$EU$49,$FF$25:$FF$49))","v":""},{"$f":"IF(OR(GO25=0,COUNTIF($FG$25:$FG$49,GO25)=0),\"\",MATCH(GO25,$FG$25:$FG$49,0))","v":""},{"$f":"IF(GP25=\"\",0,LOOKUP(GP25,$EU$25:$EU$49,$FH$25:$FH$49))","v":0},{"$f":"IF(OR(GO25=\"\",COUNTIF($FG$25:$FG$49,GO25)=0),\"\",MATCH(GO25,$FG$25:$FG$49,0))","v":""},{"$f":"IF(GR25=\"\",\"\",LOOKUP(GR25,$EU$25:$EU$49,$FF$25:$FF$49))","v":""},{"$f":"IF(OR(GS25=0,COUNTIF($FG$25:$FG$49,GS25)=0),\"\",MATCH(GS25,$FG$25:$FG$49,0))","v":""},{"$f":"IF(GT25=\"\",0,LOOKUP(GT25,$EU$25:$EU$49,$FH$25:$FH$49))","v":0},{"$f":"IF(OR(GS25=\"\",COUNTIF($FG$25:$FG$49,GS25)=0),\"\",MATCH(GS25,$FG$25:$FG$49,0))","v":""},{"$f":"IF(GV25=\"\",\"\",LOOKUP(GV25,$EU$25:$EU$49,$FF$25:$FF$49))","v":""},{"$f":"IF(OR(GW25=0,COUNTIF($FG$25:$FG$49,GW25)=0),\"\",MATCH(GW25,$FG$25:$FG$49,0))","v":""},{"$f":"IF(GX25=\"\",0,LOOKUP(GX25,$EU$25:$EU$49,$FH$25:$FH$49))","v":0},{"$f":"IF(OR(GW25=\"\",COUNTIF($FG$25:$FG$49,GW25)=0),\"\",MATCH(GW25,$FG$25:$FG$49,0))","v":""},{"$f":"IF(GZ25=\"\",\"\",LOOKUP(GZ25,$EU$25:$EU$49,$FF$25:$FF$49))","v":""},{"$f":"IF(OR(HA25=0,COUNTIF($FG$25:$FG$49,HA25)=0),\"\",MATCH(HA25,$FG$25:$FG$49,0))","v":""},{"$f":"IF(HB25=\"\",0,LOOKUP(HB25,$EU$25:$EU$49,$FH$25:$FH$49))","v":0},{"$f":"IF(OR(HA25=\"\",COUNTIF($FG$25:$FG$49,HA25)=0),\"\",MATCH(HA25,$FG$25:$FG$49,0))","v":""},{"$f":"IF(HD25=\"\",\"\",LOOKUP(HD25,$EU$25:$EU$49,$FF$25:$FF$49))","v":""},{"$f":"IF(OR(HE25=0,COUNTIF($FG$25:$FG$49,HE25)=0),\"\",MATCH(HE25,$FG$25:$FG$49,0))","v":""},{"$f":"IF(HF25=\"\",0,LOOKUP(HF25,$EU$25:$EU$49,$FH$25:$FH$49))","v":0},{"$f":"IF(OR(HE25=\"\",COUNTIF($FG$25:$FG$49,HE25)=0),\"\",MATCH(HE25,$FG$25:$FG$49,0))","v":""},{"$f":"IF(HH25=\"\",\"\",LOOKUP(HH25,$EU$25:$EU$49,$FF$25:$FF$49))","v":""},{"$f":"IF(OR(HI25=0,COUNTIF($FG$25:$FG$49,HI25)=0),\"\",MATCH(HI25,$FG$25:$FG$49,0))","v":""},{"$f":"IF(HJ25=\"\",0,LOOKUP(HJ25,$EU$25:$EU$49,$FH$25:$FH$49))","v":0},{"$f":"IF(OR(HI25=\"\",COUNTIF($FG$25:$FG$49,HI25)=0),\"\",MATCH(HI25,$FG$25:$FG$49,0))","v":""},{"$f":"IF(HL25=\"\",\"\",LOOKUP(HL25,$EU$25:$EU$49,$FF$25:$FF$49))","v":""},{"$f":"IF(OR(HM25=0,COUNTIF($FG$25:$FG$49,HM25)=0),\"\",MATCH(HM25,$FG$25:$FG$49,0))","v":""},{"$f":"IF(HN25=\"\",0,LOOKUP(HN25,$EU$25:$EU$49,$FH$25:$FH$49))","v":0},{"$f":"IF(OR(HM25=\"\",COUNTIF($FG$25:$FG$49,HM25)=0),\"\",MATCH(HM25,$FG$25:$FG$49,0))","v":""},{"$f":"IF(HP25=\"\",\"\",LOOKUP(HP25,$EU$25:$EU$49,$FF$25:$FF$49))","v":""},{"$f":"IF(OR(HQ25=0,COUNTIF($FG$25:$FG$49,HQ25)=0),\"\",MATCH(HQ25,$FG$25:$FG$49,0))","v":""},{"$f":"IF(HR25=\"\",0,LOOKUP(HR25,$EU$25:$EU$49,$FH$25:$FH$49))","v":0},{"$f":"IF(OR(HQ25=\"\",COUNTIF($FG$25:$FG$49,HQ25)=0),\"\",MATCH(HQ25,$FG$25:$FG$49,0))","v":""},{"$f":"IF(HT25=\"\",\"\",LOOKUP(HT25,$EU$25:$EU$49,$FF$25:$FF$49))","v":""},{"$f":"IF(OR(HU25=0,COUNTIF($FG$25:$FG$49,HU25)=0),\"\",MATCH(HU25,$FG$25:$FG$49,0))","v":""},{"$f":"IF(HV25=\"\",0,LOOKUP(HV25,$EU$25:$EU$49,$FH$25:$FH$49))","v":0},{"$f":"IF(OR(HU25=\"\",COUNTIF($FG$25:$FG$49,HU25)=0),\"\",MATCH(HU25,$FG$25:$FG$49,0))","v":""},{"$f":"IF(HX25=\"\",\"\",LOOKUP(HX25,$EU$25:$EU$49,$FF$25:$FF$49))","v":""},{"$f":"IF(OR(HY25=0,COUNTIF($FG$25:$FG$49,HY25)=0),\"\",MATCH(HY25,$FG$25:$FG$49,0))","v":""},{"$f":"IF(HZ25=\"\",0,LOOKUP(HZ25,$EU$25:$EU$49,$FH$25:$FH$49))","v":0},{"$f":"IF(OR(HY25=\"\",COUNTIF($FG$25:$FG$49,HY25)=0),\"\",MATCH(HY25,$FG$25:$FG$49,0))","v":""},{"$f":"IF(IB25=\"\",\"\",LOOKUP(IB25,$EU$25:$EU$49,$FF$25:$FF$49))","v":""},{"$f":"IF(OR(IC25=0,COUNTIF($FG$25:$FG$49,IC25)=0),\"\",MATCH(IC25,$FG$25:$FG$49,0))","v":""},{"$f":"IF(ID25=\"\",0,LOOKUP(ID25,$EU$25:$EU$49,$FH$25:$FH$49))","v":0},{"$f":"IF(OR(IC25=\"\",COUNTIF($FG$25:$FG$49,IC25)=0),\"\",MATCH(IC25,$FG$25:$FG$49,0))","v":""},{"$f":"IF(IF25=\"\",\"\",LOOKUP(IF25,$EU$25:$EU$49,$FF$25:$FF$49))","v":""},{"$f":"IF(OR(IG25=0,COUNTIF($FG$25:$FG$49,IG25)=0),\"\",MATCH(IG25,$FG$25:$FG$49,0))","v":""},{"$f":"IF(IH25=\"\",0,LOOKUP(IH25,$EU$25:$EU$49,$FH$25:$FH$49))","v":0},{"$f":"IF(OR(IG25=\"\",COUNTIF($FG$25:$FG$49,IG25)=0),\"\",MATCH(IG25,$FG$25:$FG$49,0))","v":""},{"$f":"IF(IJ25=\"\",\"\",LOOKUP(IJ25,$EU$25:$EU$49,$FF$25:$FF$49))","v":""},{"$f":"IF(OR(IK25=0,COUNTIF($FG$25:$FG$49,IK25)=0),\"\",MATCH(IK25,$FG$25:$FG$49,0))","v":""},{"$f":"IF(IL25=\"\",0,LOOKUP(IL25,$EU$25:$EU$49,$FH$25:$FH$49))","v":0},{"$f":"IF(OR(IK25=\"\",COUNTIF($FG$25:$FG$49,IK25)=0),\"\",MATCH(IK25,$FG$25:$FG$49,0))","v":""},{"$f":"IF(IN25=\"\",\"\",LOOKUP(IN25,$EU$25:$EU$49,$FF$25:$FF$49))","v":""},{"$f":"IF(OR(IO25=0,COUNTIF($FG$25:$FG$49,IO25)=0),\"\",MATCH(IO25,$FG$25:$FG$49,0))","v":""},{"$f":"IF(IP25=\"\",0,LOOKUP(IP25,$EU$25:$EU$49,$FH$25:$FH$49))","v":0},{"$f":"IF(OR(IO25=\"\",COUNTIF($FG$25:$FG$49,IO25)=0),\"\",MATCH(IO25,$FG$25:$FG$49,0))","v":""},{"$f":"IF(IR25=\"\",\"\",LOOKUP(IR25,$EU$25:$EU$49,$FF$25:$FF$49))","v":""},{"$f":"IF(OR(IS25=0,COUNTIF($FG$25:$FG$49,IS25)=0),\"\",MATCH(IS25,$FG$25:$FG$49,0))","v":""},{"$f":"IF(IT25=\"\",0,LOOKUP(IT25,$EU$25:$EU$49,$FH$25:$FH$49))","v":0},{"$f":"IF(OR(IS25=\"\",COUNTIF($FG$25:$FG$49,IS25)=0),\"\",MATCH(IS25,$FG$25:$FG$49,0))","v":""},{"$f":"IF(IV25=\"\",\"\",LOOKUP(IV25,$EU$25:$EU$49,$FF$25:$FF$49))","v":""},{"$f":"IF(OR(IW25=0,COUNTIF($FG$25:$FG$49,IW25)=0),\"\",MATCH(IW25,$FG$25:$FG$49,0))","v":""},{"$f":"IF(IX25=\"\",0,LOOKUP(IX25,$EU$25:$EU$49,$FH$25:$FH$49))","v":0}]
[{"$f":"IF(AND(D26=\"s\",OR(B26=\"c\",B26=\"nc1\")),\"ss1\",\"\")","v":""},"",{"$f":"IF(AND(H26<=$AU$7,LEN(F26)>1,LEFT(F26,1)=\"s\",OR(RIGHT(F26,1)=\"0\",RIGHT(F26,1)=\"1\",RIGHT(F26,1)=\"2\",RIGHT(F26,1)=\"3\",RIGHT(F26,1)=\"4\",RIGHT(F26,1)=\"5\",RIGHT(F26,1)=\"6\",RIGHT(F26,1)=\"7\",RIGHT(F26,1)=\"8\",RIGHT(F26,1)=\"9\")),\"s\",\"\")","v":""},"",{"$f":"IF(DO55=\"\",\"\",SUM($DO$54:DO55))","v":""},null,null,null,null,null,null,{"$f":"IF('Quadro 2'!G14=\"\",\"\",'Quadro 2'!G14)","v":""},{"$f":"IF(J26=\"\",\"\",IF(L26=\"\",ABS(J26)*(1+$P$14),ABS(J26)+L26))","v":""},"","",{"$f":"IFERROR(IF(OR(H26=\"\",M26=\"\",$AU$8=\"\",$DJ$52=\"\"),\"\",IF(AND(H26<=$AU$7,D26=\"s\"),$P$11,$N$24)),\"\")","v":""},"",{"$f":"IF(OR(M26=\"\",$AU$8=\"\",$AU$9=\"\",$DJ$52=\"\"),\"\",IF(AND(H26=1,D26=\"s\",DO26=\"c\"),$AU$8,IFERROR(IF(OR(EX55=\"\",EX55=0,EX55<H26*$AU$8),H26*$AU$8,EX55),H26*$AU$8)))","v":""},"","",null,{"$f":"IF(E26=\"\",\"\",IF($U26<>\"\",$U26,IF(AND($A$5>=1,$A$5<=7,MAX($CW26:$CY26)=0),T26,IF(AND($A$5>=1,$A$5<=7),MAX($CW26:$CY26),IF(AND($A$5>=11,$A$5<=18),MAX($CT56:$CV56),IF($A$5=8,$CT26,IF($A$5=9,$CU26,IF($A$5=10,$CV26,T26))))))))","v":""},{"$f":"IF(OR(H26=\"\",V26=\"\",V26=0),\"\",IF($V26>'Quadro 1'!$G$23,'Quadro 1'!$G$23,IF($V26<'Quadro 1'!$G$10,'Quadro 1'!$G$10,MIN($X26,$Y26))))","v":""},{"$f":"IF($V26<='Quadro 1'!$G$10,'Quadro 1'!$G$10,IF($V26<='Quadro 1'!$G$11,'Quadro 1'!$G$11,IF($V26<='Quadro 1'!$G$12,'Quadro 1'!$G$12,IF($V26<='Quadro 1'!$G$13,'Quadro 1'!$G$13,IF($V26<='Quadro 1'!$G$14,'Quadro 1'!$G$14,IF($V26<='Quadro 1'!$G$15,'Quadro 1'!$G$15,IF($V26<='Quadro 1'!$G$16,'Quadro 1'!$G$16,\"\")))))))","v":""},{"$f":"IF(OR(V26=\"\",V26=0),\"\",IF($V26<='Quadro 1'!$G$17,'Quadro 1'!$G$17,IF($V26<='Quadro 1'!$G$18,'Quadro 1'!$G$18,IF($V26<='Quadro 1'!$G$19,'Quadro 1'!$G$19,IF($V26<='Quadro 1'!$G$20,'Quadro 1'!$G$20,IF($V26<='Quadro 1'!$G$21,'Quadro 1'!$G$21,IF($V26<='Quadro 1'!$G$22,'Quadro 1'!$G$22,IF($V26<='Quadro 1'!$G$23,'Quadro 1'!$G$23,'Quadro 1'!$G$23))))))))","v":""},{"$f":"IF(W26=\"\",\"\",LOOKUP(W26,'Quadro 1'!$G$9:$G$23,'Quadro 1'!$H$9:$H$23))","v":""},{"$f":"IF(W26=\"\",\"\",LOOKUP(W26,'Quadro 1'!$G$9:$G$23,'Quadro 1'!$D$9:$D$23))","v":""},{"$f":"IF(W26=\"\",\"\",LOOKUP(W26,'Quadro 1'!$G$9:$G$23,'Quadro 1'!$E$9:$E$23))","v":""},"","","",{"$f":"IF(OR(M26=\"\",AE26=\"\"),\"\",ABS(M26*AE26))","v":""},{"$f":"IF(OR($G26=\"\",H26=0,$K26=\"\"),\"\",K26*$AU$19*$B$18)","v":""},"","","",null,null,null,"","",null,null,null,{"$f":"IF(AT26=\"\",0,IF(R26<AT26,1,0))","v":0},{"$f":"IF(OR(H26=\"\",R26=\"\",R26=0),0,H26*$AU$8)","v":0},{"$f":"IF(AT131=\"\",AU131,IF(OR(AT131<>0,AT131<>1),AT131,AU131))","v":1},"",{"$f":"IF(BF26<>\"\",BF26,IF(MAX(AX26,BB26,BC26)=0,\"\",MAX(AX26,BB26,BC26)))","v":""},"",{"$f":"IF(AND(A26=\"\",B26=\"\"),\"\",IF(AND(OR(A26<>\"\",B26<>\"\"),OR(F26=\"\",G26=\"\",H26=\"\",I26=\"\",J26=\"\")),1,IF(OR($A$24<$AU$7,AND(MAX($H$25:$H$49)<$P$8,MAX($H$25:$H$49)<$AU$6)),1,\"\")))","v":""},{"$f":"IF(AND(FF26=$EV$53,B26=\"c\"),$BA$23,IF(AND(FF26=$EV$53,B26=\"nc\"),$BA$23,BD26))","v":1},{"$f":"IF(AND(FF26=$EV$53,B26=\"c\"),BD26,IF(AND(FF26=$EV$53,B26=\"nc\"),\"\",\"\"))","v":""},{"$f":"IF(BD26=\"\",\"\",LOOKUP(BD26,$DN$25:$DN$49,$BF$25:$BF$49))","v":""},{"$f":"IF($BC$23=\"\",\"\",IF(FF26=$BC$24,LOOKUP($BC$23,$DN$25:$DN$49,$BF$25:$BF$49),\"\"))","v":""},{"$f":"IF(OR($FF26=\"\",COUNTIF($FF$25:$FF$49,$FF26)=0),\"\",MATCH($FF26,$FF$25:$FF$49,0))","v":1},{"$f":"IFERROR(IF(OR($G26=\"\",H26=0),\"\",IF(V26=\"\",0,IF(AND(BG26=\"\",AF26<>\"\",AC26<>\"\"),(AC26-AF26),BG26))),\"\")","v":""},"","",{"$f":"IF($AU$9=\"\",\"\",IF(AND($EV26=\"crítico\",$EU26=$EW$23),$AU$9,IF(BI26>0,BI26,0)))","v":0},{"$f":"MIN(BJ26:CH26)","v":0},"","","","","","","","","","","","","","","","","","","","","","","","","","0",0,"NA","",{"$f":"IF(OR(DT26=\"\",DS26=1),\"\",IFERROR(MATCH(DT26,$FF$25:$FF$49,0),\"\"))","v":""},"","","","",0,{"$f":"IF(OR(AND($A$5<1,$A$5>18),$E26=\"\"),\"\",IF(AND($I26=\"\",$H26=\"\"),\"\",IF($I26=\"\",$H26,I26)))","v":""},{"$f":"IF($CS26<=2,27.3,IF($CS26<=3,36,IF($CS26<=5,41.9,IF($CS26<=10,53.1,IF($CS26<=20,68.9,IF($CS26<=30,80.9,IF($CS26<=40,105.3,IF($CS26<=60,129.7,155.1))))))))","v":155.1},{"$f":"IF($CS26<=2,27.3,IF($CS26<=3,36,IF($CS26<=5,41.9,IF($CS26<=10,53.1,IF($CS26<=20,68.9,IF($CS26<=30,80.9,IF($CS26<=40,105.3,IF($CS26<=60,129.7,155.1))))))))","v":155.1},{"$f":"IF($CS26=1,27.3,IF($CS26<=2,36,IF($CS26<=3,41.9,IF($CS26<=5,53.1,IF($CS26<=8,68.9,IF($CS26<=15,80.9,IF($CS26<=30,105.3,IF($CS26<=40,129.7,155.1))))))))","v":155.1},"","",{"$f":"IF(OR(AND($A$5<>5,$A$5<>6,$A$5<>7),$E26=\"\"),\"\",IF($CS26<=1,27.3,IF($CS26<=2,36,IF($CS26<=5,41.9,IF($CS26<=8,53.1,IF($CS26<=15,68.9,IF($CS26<=27,80.9,IF($CS26<=55,105.3,129.7))))))))","v":""},1,{"$f":"IF(DB26<>\"\",DB26,IF(DC26<>\"\",DC26,\"\"))","v":""},{"$f":"IF(DD26<>\"\",DD26,IF(DE26<>\"\",DE26,IF(DF26<>\"\",DF26,IF(DG26<>\"\",DG26,IF(DH26<>\"\",DH26,IF(DI26<>\"\",DI26,IF(DJ26<>\"\",DJ26,\"\")))))))","v":""},{"$f":"IF(DK26<>\"\",DK26,IF(DL26<>\"\",DL26,IF(DM26<>\"\",DM26,\"\")))","v":""},"","","","","","","","","","",2,{"$f":"IF(DP26=\"\",\"\",IF(DP26>=1,\"c\",IF(AND($AX$52<$AU$7,DA26=$FB$53),\"nc1\",IF(AND(D26=\"s\",H26<>I26,$AJ$6<>\"x\"),\"nc2\",\"nc\"))))","v":""},"",{"$f":"IF(F26<>\"\",F26,\"\")","v":""},{"$f":"IF(G26<>\"\",G26,\"\")","v":""},"","","","","","","","","","","","","","","","","","","","","","","","","","",null,null,2,"Crítico",1,"Crítico",{"$f":"IF(EX26=\"\",\"\",1)","v":1},"Crítico",1,0,"",{"$f":"IF(FC26=\"\",\"\",1)","v":""},{"$f":"FH26+FK26+FO26+FS26+FW26+GA26+GE26+GI26+GM26+GQ26+GU26+GY26+HC26+HG26+HK26+HO26+HS26+HW26+IA26+IE26+II26+IM26+IQ26+IU26+IY26","v":0},0,0,{"$f":"IF(OR($J26=\"\",$J26=0,$FG26=\"\"),0,$J26)","v":0},{"$f":"IF(FG26=0,\"\",FF26)","v":""},"",0,"","","",0,"","","",0,"","","",0,"","","",0,"","","",0,"","","",0,"","","",0,"","","",0,"","","",0,"","","",0,"","","",0,"","","",0,"","","",0,"","","",0,"","","",0,"","","",0,"","","",0,"","","",0,"","","",0,"","","",0,"","","",0,"","","",0,"","","",0]
["","","","",{"$f":"IF(DO56=\"\",\"\",SUM($DO$54:DO56))","v":""},null,null,null,null,null,null,{"$f":"IF('Quadro 2'!G15=\"\",\"\",'Quadro 2'!G15)","v":""},"","","",{"$f":"IFERROR(IF(OR(H27=\"\",M27=\"\",$AU$8=\"\",$DJ$52=\"\"),\"\",IF(AND(H27<=$AU$7,D27=\"s\"),$P$11,$N$24)),\"\")","v":""},"","","","",null,"",{"$f":"IF(OR(H27=\"\",V27=\"\",V27=0),\"\",IF($V27>'Quadro 1'!$G$23,'Quadro 1'!$G$23,IF($V27<'Quadro 1'!$G$10,'Quadro 1'!$G$10,MIN($X27,$Y27))))","v":""},{"$f":"IF($V27<='Quadro 1'!$G$10,'Quadro 1'!$G$10,IF($V27<='Quadro 1'!$G$11,'Quadro 1'!$G$11,IF($V27<='Quadro 1'!$G$12,'Quadro 1'!$G$12,IF($V27<='Quadro 1'!$G$13,'Quadro 1'!$G$13,IF($V27<='Quadro 1'!$G$14,'Quadro 1'!$G$14,IF($V27<='Quadro 1'!$G$15,'Quadro 1'!$G$15,IF($V27<='Quadro 1'!$G$16,'Quadro 1'!$G$16,\"\")))))))","v":""},{"$f":"IF(OR(V27=\"\",V27=0),\"\",IF($V27<='Quadro 1'!$G$17,'Quadro 1'!$G$17,IF($V27<='Quadro 1'!$G$18,'Quadro 1'!$G$18,IF($V27<='Quadro 1'!$G$19,'Quadro 1'!$G$19,IF($V27<='Quadro 1'!$G$20,'Quadro 1'!$G$20,IF($V27<='Quadro 1'!$G$21,'Quadro 1'!$G$21,IF($V27<='Quadro 1'!$G$22,'Quadro 1'!$G$22,IF($V27<='Quadro 1'!$G$23,'Quadro 1'!$G$23,'Quadro 1'!$G$23))))))))","v":""},{"$f":"IF(W27=\"\",\"\",LOOKUP(W27,'Quadro 1'!$G$9:$G$23,'Quadro 1'!$H$9:$H$23))","v":""},{"$f":"IF(W27=\"\",\"\",LOOKUP(W27,'Quadro 1'!$G$9:$G$23,'Quadro 1'!$D$9:$D$23))","v":""},{"$f":"IF(W27=\"\",\"\",LOOKUP(W27,'Quadro 1'!$G$9:$G$23,'Quadro 1'!$E$9:$E$23))","v":""},"","","","","","","","",null,null,null,"","",null,null,null,0,0,1,"",{"$f":"IF(BF27<>\"\",BF27,IF(MAX(AX27,BB27,BC27)=0,\"\",MAX(AX27,BB27,BC27)))","v":""},"","",1,"","","",1,"","","",0,0,"","","","","","","","","","","","","","","","","","","","","","","","","","0",0,"NA","","","","","","",0,"",{"$f":"IF($CS27<=2,27.3,IF($CS27<=3,36,IF($CS27<=5,41.9,IF($CS27<=10,53.1,IF($CS27<=20,68.9,IF($CS27<=30,80.9,IF($CS27<=40,105.3,IF($CS27<=60,129.7,155.1))))))))","v":155.1},{"$f":"IF($CS27<=2,27.3,IF($CS27<=3,36,IF($CS27<=5,41.9,IF($CS27<=10,53.1,IF($CS27<=20,68.9,IF($CS27<=30,80.9,IF($CS27<=40,105.3,IF($CS27<=60,129.7,155.1))))))))","v":155.1},155.1,"","","",1,"","","","","","","","","","","","","",3,"","","","","","","","","","","","","","","","","","","","","","","","","","","","","","",null,null,3,"Crítico",1,"Crítico",1,"Crítico",1,0,"","",0,0,0,0,"","",0,"","","",0,"","","",0,"","","",0,"","","",0,"","","",0,"","","",0,"","","",0,"","","",0,"","","",0,"","","",0,"","","",0,"","","",0,"","","",0,"","","",0,"","","",0,"","","",0,"","","",0,"","","",0,"","","",0,"","","",0,"","","",0,"","","",0,"","","",0]
["","","","",{"$f":"IF(DO57=\"\",\"\",SUM($DO$54:DO57))","v":""},null,null,null,null,null,null,{"$f":"IF('Quadro 2'!G16=\"\",\"\",'Quadro 2'!G16)","v":""},"","","","","","","","",null,"",{"$f":"IF(OR(H28=\"\",V28=\"\",V28=0),\"\",IF($V28>'Quadro 1'!$G$23,'Quadro 1'!$G$23,IF($V28<'Quadro 1'!$G$10,'Quadro 1'!$G$10,MIN($X28,$Y28))))","v":""},{"$f":"IF($V28<='Quadro 1'!$G$10,'Quadro 1'!$G$10,IF($V28<='Quadro 1'!$G$11,'Quadro 1'!$G$11,IF($V28<='Quadro 1'!$G$12,'Quadro 1'!$G$12,IF($V28<='Quadro 1'!$G$13,'Quadro 1'!$G$13,IF($V28<='Quadro 1'!$G$14,'Quadro 1'!$G$14,IF($V28<='Quadro 1'!$G$15,'Quadro 1'!$G$15,IF($V28<='Quadro 1'!$G$16,'Quadro 1'!$G$16,\"\")))))))","v":""},{"$f":"IF(OR(V28=\"\",V28=0),\"\",IF($V28<='Quadro 1'!$G$17,'Quadro 1'!$G$17,IF($V28<='Quadro 1'!$G$18,'Quadro 1'!$G$18,IF($V28<='Quadro 1'!$G$19,'Quadro 1'!$G$19,IF($V28<='Quadro 1'!$G$20,'Quadro 1'!$G$20,IF($V28<='Quadro 1'!$G$21,'Quadro 1'!$G$21,IF($V28<='Quadro 1'!$G$22,'Quadro 1'!$G$22,IF($V28<='Quadro 1'!$G$23,'Quadro 1'!$G$23,'Quadro 1'!$G$23))))))))","v":""},{"$f":"IF(W28=\"\",\"\",LOOKUP(W28,'Quadro 1'!$G$9:$G$23,'Quadro 1'!$H$9:$H$23))","v":""},{"$f":"IF(W28=\"\",\"\",LOOKUP(W28,'Quadro 1'!$G$9:$G$23,'Quadro 1'!$D$9:$D$23))","v":""},{"$f":"IF(W28=\"\",\"\",LOOKUP(W28,'Quadro 1'!$G$9:$G$23,'Quadro 1'!$E$9:$E$23))","v":""},"","","","","","","","",null,null,null,"","",null,null,null,0,0,1,"",{"$f":"IF(BF28<>\"\",BF28,IF(MAX(AX28,BB28,BC28)=0,\"\",MAX(AX28,BB28,BC28)))","v":""},"","",1,"","","",1,"","","",0,0,"","","","","","","","","","","","","","","","","","","","","","","","","","0",0,"NA","","","","","","",0,"",{"$f":"IF($CS28<=2,27.3,IF($CS28<=3,36,IF($CS28<=5,41.9,IF($CS28<=10,53.1,IF($CS28<=20,68.9,IF($CS28<=30,80.9,IF($CS28<=40,105.3,IF($CS28<=60,129.7,155.1))))))))","v":155.1},155.1,155.1,"","","",1,"","","","","","","","","","","","","",4,"","","","","","","","","","","","","","","","","","","","","","","","","","","","","","",null,null,4,"Crítico",1,"Crítico",1,"Crítico",1,0,"","",0,0,0,0,"","",0,"","","",0,"","","",0,"","","",0,"","","",0,"","","",0,"","","",0,"","","",0,"","","",0,"","","",0,"","","",0,"","","",0,"","","",0,"","","",0,"","","",0,"","","",0,"","","",0,"","","",0,"","","",0,"","","",0,"","","",0,"","","",0,"","","",0,"","","",0]
["","","","",{"$f":"IF(DO58=\"\",\"\",SUM($DO$54:DO58))","v":""},null,null,null,null,null,null,{"$f":"IF('Quadro 2'!G17=\"\",\"\",'Quadro 2'!G17)","v":""},"","","","","","","","",null,"",{"$f":"IF(OR(H29=\"\",V29=\"\",V29=0),\"\",IF($V29>'Quadro 1'!$G$23,'Quadro 1'!$G$23,IF($V29<'Quadro 1'!$G$10,'Quadro 1'!$G$10,MIN($X29,$Y29))))","v":""},{"$f":"IF($V29<='Quadro 1'!$G$10,'Quadro 1'!$G$10,IF($V29<='Quadro 1'!$G$11,'Quadro 1'!$G$11,IF($V29<='Quadro 1'!$G$12,'Quadro 1'!$G$12,IF($V29<='Quadro 1'!$G$13,'Quadro 1'!$G$13,IF($V29<='Quadro 1'!$G$14,'Quadro 1'!$G$14,IF($V29<='Quadro 1'!$G$15,'Quadro 1'!$G$15,IF($V29<='Quadro 1'!$G$16,'Quadro 1'!$G$16,\"\")))))))","v":""},{"$f":"IF(OR(V29=\"\",V29=0),\"\",IF($V29<='Quadro 1'!$G$17,'Quadro 1'!$G$17,IF($V29<='Quadro 1'!$G$18,'Quadro 1'!$G$18,IF($V29<='Quadro 1'!$G$19,'Quadro 1'!$G$19,IF($V29<='Quadro 1'!$G$20,'Quadro 1'!$G$20,IF($V29<='Quadro 1'!$G$21,'Quadro 1'!$G$21,IF($V29<='Quadro 1'!$G$22,'Quadro 1'!$G$22,IF($V29<='Quadro 1'!$G$23,'Quadro 1'!$G$23,'Quadro 1'!$G$23))))))))","v":""},{"$f":"IF(W29=\"\",\"\",LOOKUP(W29,'Quadro 1'!$G$9:$G$23,'Quadro 1'!$H$9:$H$23))","v":""},{"$f":"IF(W29=\"\",\"\",LOOKUP(W29,'Quadro 1'!$G$9:$G$23,'Quadro 1'!$D$9:$D$23))","v":""},{"$f":"IF(W29=\"\",\"\",LOOKUP(W29,'Quadro 1'!$G$9:$G$23,'Quadro 1'!$E$9:$E$23))","v":""},"","","","","","","","",null,null,null,"","",null,null,null,0,0,1,"",{"$f":"IF(BF29<>\"\",BF29,IF(MAX(AX29,BB29,BC29)=0,\"\",MAX(AX29,BB29,BC29)))","v":""},"","",1,"","","",1,"","","",{"$f":"IF($AU$9=\"\",\"\",IF(AND($EV29=\"crítico\",$EU29=$EW$23),$AU$9,IF(BI29>0,BI29,0)))","v":0},0,"","","","","","","","","","","","","","","","","","","","","","","","","","0",0,"NA","","","","","","",0,"",{"$f":"IF($CS29<=2,27.3,IF($CS29<=3,36,IF($CS29<=5,41.9,IF($CS29<=10,53.1,IF($CS29<=20,68.9,IF($CS29<=30,80.9,IF($CS29<=40,105.3,IF($CS29<=60,129.7,155.1))))))))","v":155.1},155.1,155.1,"","","",1,"","","","","","","","","","","","","",5,"","","","","","","","","","","","","","","","","","","","","","","","","","","","","","",null,null,5,"Crítico",1,"Crítico",1,"Crítico",1,0,"","",0,0,0,0,"","",0,"","","",0,"","","",0,"","","",0,"","","",0,"","","",0,"","","",0,"","","",0,"","","",0,"","","",0,"","","",0,"","","",0,"","","",0,"","","",0,"","","",0,"","","",0,"","","",0,"","","",0,"","","",0,"","","",0,"","","",0,"","","",0,"","","",0,"","","",0]
["","","","",{"$f":"IF(DO59=\"\",\"\",SUM($DO$54:DO59))","v":""},null,null,null,null,null,null,{"$f":"IF('Quadro 2'!G18=\"\",\"\",'Quadro 2'!G18)","v":""},"","","","","","","","",null,"",{"$f":"IF(OR(H30=\"\",V30=\"\",V30=0),\"\",IF($V30>'Quadro 1'!$G$23,'Quadro 1'!$G$23,IF($V30<'Quadro 1'!$G$10,'Quadro 1'!$G$10,MIN($X30,$Y30))))","v":""},{"$f":"IF($V30<='Quadro 1'!$G$10,'Quadro 1'!$G$10,IF($V30<='Quadro 1'!$G$11,'Quadro 1'!$G$11,IF($V30<='Quadro 1'!$G$12,'Quadro 1'!$G$12,IF($V30<='Quadro 1'!$G$13,'Quadro 1'!$G$13,IF($V30<='Quadro 1'!$G$14,'Quadro 1'!$G$14,IF($V30<='Quadro 1'!$G$15,'Quadro 1'!$G$15,IF($V30<='Quadro 1'!$G$16,'Quadro 1'!$G$16,\"\")))))))","v":""},{"$f":"IF(OR(V30=\"\",V30=0),\"\",IF($V30<='Quadro 1'!$G$17,'Quadro 1'!$G$17,IF($V30<='Quadro 1'!$G$18,'Quadro 1'!$G$18,IF($V30<='Quadro 1'!$G$19,'Quadro 1'!$G$19,IF($V30<='Quadro 1'!$G$20,'Quadro 1'!$G$20,IF($V30<='Quadro 1'!$G$21,'Quadro 1'!$G$21,IF($V30<='Quadro 1'!$G$22,'Quadro 1'!$G$22,IF($V30<='Quadro 1'!$G$23,'Quadro 1'!$G$23,'Quadro 1'!$G$23))))))))","v":""},{"$f":"IF(W30=\"\",\"\",LOOKUP(W30,'Quadro 1'!$G$9:$G$23,'Quadro 1'!$H$9:$H$23))","v":""},{"$f":"IF(W30=\"\",\"\",LOOKUP(W30,'Quadro 1'!$G$9:$G$23,'Quadro 1'!$D$9:$D$23))","v":""},{"$f":"IF(W30=\"\",\"\",LOOKUP(W30,'Quadro 1'!$G$9:$G$23,'Quadro 1'!$E$9:$E$23))","v":""},"","","","","","","","",null,null,null,"","",null,null,null,0,0,1,"","","","",1,"","","",1,"","","",0,0,"","","","","","","","","","","","","","","","","","","","","","","","","","0",0,"NA","","","","","","",0,"",155.1,155.1,155.1,"","","",1,"","","","","","","","","","","","","",6,"","","","","","","","","","","","","","","","","","","","","","","","","","","","","","",null,null,6,"Crítico",1,"Crítico",1,"Crítico",1,0,"","",0,0,0,0,"","",0,"","","",0,"","","",0,"","","",0,"","","",0,"","","",0,"","","",0,"","","",0,"","","",0,"","","",0,"","","",0,"","","",0,"","","",0,"","","",0,"","","",0,"","","",0,"","","",0,"","","",0,"","","",0,"","","",0,"","","",0,"","","",0,"","","",0,"","","",0]
["","","",{"$f":"IF(AND(H31<=$AU$7,LEN(G31)>1,LEFT(G31,1)=\"s\",OR(RIGHT(G31,1)=\"0\",RIGHT(G31,1)=\"1\",RIGHT(G31,1)=\"2\",RIGHT(G31,1)=\"3\",RIGHT(G31,1)=\"4\",RIGHT(G31,1)=\"5\",RIGHT(G31,1)=\"6\",RIGHT(G31,1)=\"7\",RIGHT(G31,1)=\"8\",RIGHT(G31,1)=\"9\")),\"s\",\"\")","v":""},{"$f":"IF(DO60=\"\",\"\",SUM($DO$54:DO60))","v":""},null,null,null,null,null,null,{"$f":"IF('Quadro 2'!G19=\"\",\"\",'Quadro 2'!G19)","v":""},"","",{"$f":"IFERROR(IF(OR(F31=\"\",G31=\"\",H31=\"\",$AU$8=\"\",$AU$9=\"\",$DJ$52=\"\"),\"\",IF(AND($EV$53<>\"\",D31<>\"s\",B31=\"nc\",CEILING(H31/$AU$7,1)<=$BB$115),VLOOKUP(CEILING(H31/$AU$7,1),$BB$116:$BC$124,2,FALSE),\"\")),\"\")","v":""},"","","","","",null,"",{"$f":"IF(OR(H31=\"\",V31=\"\",V31=0),\"\",IF($V31>'Quadro 1'!$G$23,'Quadro 1'!$G$23,IF($V31<'Quadro 1'!$G$10,'Quadro 1'!$G$10,MIN($X31,$Y31))))","v":""},{"$f":"IF($V31<='Quadro 1'!$G$10,'Quadro 1'!$G$10,IF($V31<='Quadro 1'!$G$11,'Quadro 1'!$G$11,IF($V31<='Quadro 1'!$G$12,'Quadro 1'!$G$12,IF($V31<='Quadro 1'!$G$13,'Quadro 1'!$G$13,IF($V31<='Quadro 1'!$G$14,'Quadro 1'!$G$14,IF($V31<='Quadro 1'!$G$15,'Quadro 1'!$G$15,IF($V31<='Quadro 1'!$G$16,'Quadro 1'!$G$16,\"\")))))))","v":""},{"$f":"IF(OR(V31=\"\",V31=0),\"\",IF($V31<='Quadro 1'!$G$17,'Quadro 1'!$G$17,IF($V31<='Quadro 1'!$G$18,'Quadro 1'!$G$18,IF($V31<='Quadro 1'!$G$19,'Quadro 1'!$G$19,IF($V31<='Quadro 1'!$G$20,'Quadro 1'!$G$20,IF($V31<='Quadro 1'!$G$21,'Quadro 1'!$G$21,IF($V31<='Quadro 1'!$G$22,'Quadro 1'!$G$22,IF($V31<='Quadro 1'!$G$23,'Quadro 1'!$G$23,'Quadro 1'!$G$23))))))))","v":""},{"$f":"IF(W31=\"\",\"\",LOOKUP(W31,'Quadro 1'!$G$9:$G$23,'Quadro 1'!$H$9:$H$23))","v":""},{"$f":"IF(W31=\"\",\"\",LOOKUP(W31,'Quadro 1'!$G$9:$G$23,'Quadro 1'!$D$9:$D$23))","v":""},{"$f":"IF(W31=\"\",\"\",LOOKUP(W31,'Quadro 1'!$G$9:$G$23,'Quadro 1'!$E$9:$E$23))","v":""},"","","","","","","","",null,null,null,"","",null,null,null,0,0,1,"","","","",1,{"$f":"IF(AND(FF31=$EV$53,B31=\"c\"),BD31,IF(AND(FF31=$EV$53,B31=\"nc\"),\"\",\"\"))","v":""},"","",1,"","","",0,0,"","","","","","","","","","","","","","","","","","","","","","","","","","0",0,"NA","","","","","","",0,"",155.1,155.1,155.1,"","","",1,"","","","","","","","","","","","","",7,"","","","","","","","","","","","","","","","","","","","","","","","","","","","","","",null,null,7,"Crítico",1,"Crítico",1,"Crítico",1,0,"","",0,0,0,0,"","",0,"","","",0,"","","",0,"","","",0,"","","",0,"","","",0,"","","",0,"","","",0,"","","",0,"","","",0,"","","",0,"","","",0,"","","",0,"","","",0,"","","",0,"","","",0,"","","",0,"","","",0,"","","",0,"","","",0,"","","",0,"","","",0,"","","",0,"","","",0]
["","","","",{"$f":"IF(DO61=\"\",\"\",SUM($DO$54:DO61))","v":""},null,null,null,null,null,null,{"$f":"IF('Quadro 2'!G20=\"\",\"\",'Quadro 2'!G20)","v":""},"","","","","","","","",null,"",{"$f":"IF(OR(H32=\"\",V32=\"\",V32=0),\"\",IF($V32>'Quadro 1'!$G$23,'Quadro 1'!$G$23,IF($V32<'Quadro 1'!$G$10,'Quadro 1'!$G$10,MIN($X32,$Y32))))","v":""},{"$f":"IF($V32<='Quadro 1'!$G$10,'Quadro 1'!$G$10,IF($V32<='Quadro 1'!$G$11,'Quadro 1'!$G$11,IF($V32<='Quadro 1'!$G$12,'Quadro 1'!$G$12,IF($V32<='Quadro 1'!$G$13,'Quadro 1'!$G$13,IF($V32<='Quadro 1'!$G$14,'Quadro 1'!$G$14,IF($V32<='Quadro 1'!$G$15,'Quadro 1'!$G$15,IF($V32<='Quadro 1'!$G$16,'Quadro 1'!$G$16,\"\")))))))","v":""},{"$f":"IF(OR(V32=\"\",V32=0),\"\",IF($V32<='Quadro 1'!$G$17,'Quadro 1'!$G$17,IF($V32<='Quadro 1'!$G$18,'Quadro 1'!$G$18,IF($V32<='Quadro 1'!$G$19,'Quadro 1'!$G$19,IF($V32<='Quadro 1'!$G$20,'Quadro 1'!$G$20,IF($V32<='Quadro 1'!$G$21,'Quadro 1'!$G$21,IF($V32<='Quadro 1'!$G$22,'Quadro 1'!$G$22,IF($V32<='Quadro 1'!$G$23,'Quadro 1'!$G$23,'Quadro 1'!$G$23))))))))","v":""},{"$f":"IF(W32=\"\",\"\",LOOKUP(W32,'Quadro 1'!$G$9:$G$23,'Quadro 1'!$H$9:$H$23))","v":""},{"$f":"IF(W32=\"\",\"\",LOOKUP(W32,'Quadro 1'!$G$9:$G$23,'Quadro 1'!$D$9:$D$23))","v":""},{"$f":"IF(W32=\"\",\"\",LOOKUP(W32,'Quadro 1'!$G$9:$G$23,'Quadro 1'!$E$9:$E$23))","v":""},"","","","","","","","",null,null,null,"","",null,null,null,0,0,1,"","","","",{"$f":"IF(AND(FF32=$EV$53,B32=\"c\"),$BA$23,IF(AND(FF32=$EV$53,B32=\"nc\"),$BA$23,BD32))","v":1},"","","",1,"","","",0,0,"","","","","","","","","","","","","","","","","","","","","","","","","","0",0,"NA","","","","","","",0,"",155.1,155.1,155.1,"","","",1,"","","","","","","","","","","","","",8,"","","","","","","","","","","","","","","","","","","","","","","","","","","","","","",null,null,8,"Crítico",1,"Crítico",1,"Crítico",1,0,"","",0,0,0,0,"","",0,"","","",0,"","","",0,"","","",0,"","","",0,"","","",0,"","","",0,"","","",0,"","","",0,"","","",0,"","","",0,"","","",0,"","","",0,"","","",0,"","","",0,"","","",0,"","","",0,"","","",0,"","","",0,"","","",0,"","","",0,"","","",0,"","","",0,"","","",0]
["","","","",{"$f":"IF(DO62=\"\",\"\",SUM($DO$54:DO62))","v":""},null,null,null,null,null,null,{"$f":"IF('Quadro 2'!G21=\"\",\"\",'Quadro 2'!G21)","v":""},"","","","","","","","",null,"",{"$f":"IF(OR(H33=\"\",V33=\"\",V33=0),\"\",IF($V33>'Quadro 1'!$G$23,'Quadro 1'!$G$23,IF($V33<'Quadro 1'!$G$10,'Quadro 1'!$G$10,MIN($X33,$Y33))))","v":""},{"$f":"IF($V33<='Quadro 1'!$G$10,'Quadro 1'!$G$10,IF($V33<='Quadro 1'!$G$11,'Quadro 1'!$G$11,IF($V33<='Quadro 1'!$G$12,'Quadro 1'!$G$12,IF($V33<='Quadro 1'!$G$13,'Quadro 1'!$G$13,IF($V33<='Quadro 1'!$G$14,'Quadro 1'!$G$14,IF($V33<='Quadro 1'!$G$15,'Quadro 1'!$G$15,IF($V33<='Quadro 1'!$G$16,'Quadro 1'!$G$16,\"\")))))))","v":""},{"$f":"IF(OR(V33=\"\",V33=0),\"\",IF($V33<='Quadro 1'!$G$17,'Quadro 1'!$G$17,IF($V33<='Quadro 1'!$G$18,'Quadro 1'!$G$18,IF($V33<='Quadro 1'!$G$19,'Quadro 1'!$G$19,IF($V33<='Quadro 1'!$G$20,'Quadro 1'!$G$20,IF($V33<='Quadro 1'!$G$21,'Quadro 1'!$G$21,IF($V33<='Quadro 1'!$G$22,'Quadro 1'!$G$22,IF($V33<='Quadro 1'!$G$23,'Quadro 1'!$G$23,'Quadro 1'!$G$23))))))))","v":""},{"$f":"IF(W33=\"\",\"\",LOOKUP(W33,'Quadro 1'!$G$9:$G$23,'Quadro 1'!$H$9:$H$23))","v":""},{"$f":"IF(W33=\"\",\"\",LOOKUP(W33,'Quadro 1'!$G$9:$G$23,'Quadro 1'!$D$9:$D$23))","v":""},{"$f":"IF(W33=\"\",\"\",LOOKUP(W33,'Quadro 1'!$G$9:$G$23,'Quadro 1'!$E$9:$E$23))","v":""},"",{"$f":"IFERROR(IF(OR($G33=\"\",H33=0,$DJ$52=\"\"),\"\",IF(BH33=0,(BE33-K33*$AU$19*$B$18),BH33)),\"\")","v":""},"","","","","","",null,null,null,"","",null,null,null,0,0,1,"","","","",1,"","","",1,"","","",0,0,"","","","","","","","","","","","","","","","","","","","","","","","","","0",0,"NA","","","","","","",0,"",155.1,155.1,155.1,"","","",1,"","","","","","","","","","","","","",9,"","","","","","","","","","","","","","","","","","","","","","","","","","","","","","",null,null,9,"Crítico",1,"Crítico",1,"Crítico",1,0,"","",0,0,0,0,"","",0,"","","",0,"","","",0,"","","",0,"","","",0,"","","",0,"","","",0,"","","",0,"","","",0,"","","",0,"","","",0,"","","",0,"","","",0,"","","",0,"","","",0,"","","",0,"","","",0,"","","",0,"","","",0,"","","",0,"","","",0,"","","",0,"","","",0,"","","",0]
["","","","",{"$f":"IF(DO63=\"\",\"\",SUM($DO$54:DO63))","v":""},null,null,null,null,null,null,{"$f":"IF('Quadro 2'!G22=\"\",\"\",'Quadro 2'!G22)","v":""},"","","","","","","","",null,"",{"$f":"IF(OR(H34=\"\",V34=\"\",V34=0),\"\",IF($V34>'Quadro 1'!$G$23,'Quadro 1'!$G$23,IF($V34<'Quadro 1'!$G$10,'Quadro 1'!$G$10,MIN($X34,$Y34))))","v":""},{"$f":"IF($V34<='Quadro 1'!$G$10,'Quadro 1'!$G$10,IF($V34<='Quadro 1'!$G$11,'Quadro 1'!$G$11,IF($V34<='Quadro 1'!$G$12,'Quadro 1'!$G$12,IF($V34<='Quadro 1'!$G$13,'Quadro 1'!$G$13,IF($V34<='Quadro 1'!$G$14,'Quadro 1'!$G$14,IF($V34<='Quadro 1'!$G$15,'Quadro 1'!$G$15,IF($V34<='Quadro 1'!$G$16,'Quadro 1'!$G$16,\"\")))))))","v":""},{"$f":"IF(OR(V34=\"\",V34=0),\"\",IF($V34<='Quadro 1'!$G$17,'Quadro 1'!$G$17,IF($V34<='Quadro 1'!$G$18,'Quadro 1'!$G$18,IF($V34<='Quadro 1'!$G$19,'Quadro 1'!$G$19,IF($V34<='Quadro 1'!$G$20,'Quadro 1'!$G$20,IF($V34<='Quadro 1'!$G$21,'Quadro 1'!$G$21,IF($V34<='Quadro 1'!$G$22,'Quadro 1'!$G$22,IF($V34<='Quadro 1'!$G$23,'Quadro 1'!$G$23,'Quadro 1'!$G$23))))))))","v":""},{"$f":"IF(W34=\"\",\"\",LOOKUP(W34,'Quadro 1'!$G$9:$G$23,'Quadro 1'!$H$9:$H$23))","v":""},{"$f":"IF(W34=\"\",\"\",LOOKUP(W34,'Quadro 1'!$G$9:$G$23,'Quadro 1'!$D$9:$D$23))","v":""},{"$f":"IF(W34=\"\",\"\",LOOKUP(W34,'Quadro 1'!$G$9:$G$23,'Quadro 1'!$E$9:$E$23))","v":""},"",{"$f":"IFERROR(IF(OR($G34=\"\",H34=0,$DJ$52=\"\"),\"\",IF(BH34=0,(BE34-K34*$AU$19*$B$18),BH34)),\"\")","v":""},"","","","","","",null,null,null,"","",null,null,null,0,0,1,"","","","",1,"","","",1,"","","",0,0,"","","","","","","","","","","","","","","","","","","","","","","","","","0",0,"NA","","","","","","",0,"",155.1,155.1,155.1,"","","",1,"","","","","","","","","","","","","",10,"","","","","","","","","","","","","","","","","","","","","","","","","","","","","","",null,null,10,"Crítico",1,"Crítico",1,"Crítico",1,0,"","",0,0,0,0,"","",0,"","","",0,"","","",0,"","","",0,"","","",0,"","","",0,"","","",0,"","","",0,"","","",0,"","","",0,"","","",0,"","","",0,"","","",0,"","","",0,"","","",0,"","","",0,"","","",0,"","","",0,"","","",0,"","","",0,"","","",0,"","","",0,"","","",0,"","","",0]
["","","","",{"$f":"IF(DO64=\"\",\"\",SUM($DO$54:DO64))","v":""},null,null,null,null,null,null,{"$f":"IF('Quadro 2'!G23=\"\",\"\",'Quadro 2'!G23)","v":""},"","","","","","","","",null,"",{"$f":"IF(OR(H35=\"\",V35=\"\",V35=0),\"\",IF($V35>'Quadro 1'!$G$23,'Quadro 1'!$G$23,IF($V35<'Quadro 1'!$G$10,'Quadro 1'!$G$10,MIN($X35,$Y35))))","v":""},{"$f":"IF($V35<='Quadro 1'!$G$10,'Quadro 1'!$G$10,IF($V35<='Quadro 1'!$G$11,'Quadro 1'!$G$11,IF($V35<='Quadro 1'!$G$12,'Quadro 1'!$G$12,IF($V35<='Quadro 1'!$G$13,'Quadro 1'!$G$13,IF($V35<='Quadro 1'!$G$14,'Quadro 1'!$G$14,IF($V35<='Quadro 1'!$G$15,'Quadro 1'!$G$15,IF($V35<='Quadro 1'!$G$16,'Quadro 1'!$G$16,\"\")))))))","v":""},{"$f":"IF(OR(V35=\"\",V35=0),\"\",IF($V35<='Quadro 1'!$G$17,'Quadro 1'!$G$17,IF($V35<='Quadro 1'!$G$18,'Quadro 1'!$G$18,IF($V35<='Quadro 1'!$G$19,'Quadro 1'!$G$19,IF($V35<='Quadro 1'!$G$20,'Quadro 1'!$G$20,IF($V35<='Quadro 1'!$G$21,'Quadro 1'!$G$21,IF($V35<='Quadro 1'!$G$22,'Quadro 1'!$G$22,IF($V35<='Quadro 1'!$G$23,'Quadro 1'!$G$23,'Quadro 1'!$G$23))))))))","v":""},{"$f":"IF(W35=\"\",\"\",LOOKUP(W35,'Quadro 1'!$G$9:$G$23,'Quadro 1'!$H$9:$H$23))","v":""},{"$f":"IF(W35=\"\",\"\",LOOKUP(W35,'Quadro 1'!$G$9:$G$23,'Quadro 1'!$D$9:$D$23))","v":""},{"$f":"IF(W35=\"\",\"\",LOOKUP(W35,'Quadro 1'!$G$9:$G$23,'Quadro 1'!$E$9:$E$23))","v":""},"","","","","","","","",null,null,null,"","",null,null,null,0,0,1,"","","","",1,"","","",1,"","","",0,0,"","","","","","","","","","","","","","","","","","","","","","","","","","0",0,"NA","","","","","","",0,"",155.1,155.1,155.1,"","","",1,"","","","","","","","","","","","","",11,"","","","","","","","","","","","","","","","","","","","","","","","","","","","","","",null,null,11,"Crítico",1,"Crítico",1,"Crítico",1,0,"","",0,0,0,0,"","",0,"","","",0,"","","",0,"","","",0,"","","",0,"","","",0,"","","",0,"","","",0,"","","",0,"","","",0,"","","",0,"","","",0,"","","",0,"","","",0,"","","",0,"","","",0,"","","",0,"","","",0,"","","",0,"","","",0,"","","",0,"","","",0,"","","",0,"","","",0]
["","","","",{"$f":"IF(DO65=\"\",\"\",SUM($DO$54:DO65))","v":""},null,null,null,null,null,null,{"$f":"IF('Quadro 2'!G24=\"\",\"\",'Quadro 2'!G24)","v":""},"","","","","","","","",null,"",{"$f":"IF(OR(H36=\"\",V36=\"\",V36=0),\"\",IF($V36>'Quadro 1'!$G$23,'Quadro 1'!$G$23,IF($V36<'Quadro 1'!$G$10,'Quadro 1'!$G$10,MIN($X36,$Y36))))","v":""},{"$f":"IF($V36<='Quadro 1'!$G$10,'Quadro 1'!$G$10,IF($V36<='Quadro 1'!$G$11,'Quadro 1'!$G$11,IF($V36<='Quadro 1'!$G$12,'Quadro 1'!$G$12,IF($V36<='Quadro 1'!$G$13,'Quadro 1'!$G$13,IF($V36<='Quadro 1'!$G$14,'Quadro 1'!$G$14,IF($V36<='Quadro 1'!$G$15,'Quadro 1'!$G$15,IF($V36<='Quadro 1'!$G$16,'Quadro 1'!$G$16,\"\")))))))","v":""},{"$f":"IF(OR(V36=\"\",V36=0),\"\",IF($V36<='Quadro 1'!$G$17,'Quadro 1'!$G$17,IF($V36<='Quadro 1'!$G$18,'Quadro 1'!$G$18,IF($V36<='Quadro 1'!$G$19,'Quadro 1'!$G$19,IF($V36<='Quadro 1'!$G$20,'Quadro 1'!$G$20,IF($V36<='Quadro 1'!$G$21,'Quadro 1'!$G$21,IF($V36<='Quadro 1'!$G$22,'Quadro 1'!$G$22,IF($V36<='Quadro 1'!$G$23,'Quadro 1'!$G$23,'Quadro 1'!$G$23))))))))","v":""},{"$f":"IF(W36=\"\",\"\",LOOKUP(W36,'Quadro 1'!$G$9:$G$23,'Quadro 1'!$H$9:$H$23))","v":""},{"$f":"IF(W36=\"\",\"\",LOOKUP(W36,'Quadro 1'!$G$9:$G$23,'Quadro 1'!$D$9:$D$23))","v":""},{"$f":"IF(W36=\"\",\"\",LOOKUP(W36,'Quadro 1'!$G$9:$G$23,'Quadro 1'!$E$9:$E$23))","v":""},"","","","","","","","",null,null,null,"","",null,null,null,0,0,1,"","","","",1,"","","",1,"","","",0,0,"","","","","","","","","","","","","","","","","","","","","","","","","","0",0,"NA","","","","","","",0,"",155.1,155.1,155.1,"","","",1,"","","","","","","","","","","","","",12,"","","","","","","","","","","","","","","","","","","","","","","","","","","","","","",null,null,12,"Crítico",1,"Crítico",1,"Crítico",1,0,"","",0,0,0,0,"","",0,"","","",0,"","","",0,"","","",0,"","","",0,"","","",0,"","","",0,"","","",0,"","","",0,"","","",0,"","","",0,"","","",0,"","","",0,"","","",0,"","","",0,"","","",0,"","","",0,"","","",0,"","","",0,"","","",0,"","","",0,"","","",0,"","","",0,"","","",0]
["","","","",{"$f":"IF(DO66=\"\",\"\",SUM($DO$54:DO66))","v":""},null,null,null,null,null,null,{"$f":"IF('Quadro 2'!G25=\"\",\"\",'Quadro 2'!G25)","v":""},"","","","","","","","",null,"",{"$f":"IF(OR(H37=\"\",V37=\"\",V37=0),\"\",IF($V37>'Quadro 1'!$G$23,'Quadro 1'!$G$23,IF($V37<'Quadro 1'!$G$10,'Quadro 1'!$G$10,MIN($X37,$Y37))))","v":""},{"$f":"IF($V37<='Quadro 1'!$G$10,'Quadro 1'!$G$10,IF($V37<='Quadro 1'!$G$11,'Quadro 1'!$G$11,IF($V37<='Quadro 1'!$G$12,'Quadro 1'!$G$12,IF($V37<='Quadro 1'!$G$13,'Quadro 1'!$G$13,IF($V37<='Quadro 1'!$G$14,'Quadro 1'!$G$14,IF($V37<='Quadro 1'!$G$15,'Quadro 1'!$G$15,IF($V37<='Quadro 1'!$G$16,'Quadro 1'!$G$16,\"\")))))))","v":""},{"$f":"IF(OR(V37=\"\",V37=0),\"\",IF($V37<='Quadro 1'!$G$17,'Quadro 1'!$G$17,IF($V37<='Quadro 1'!$G$18,'Quadro 1'!$G$18,IF($V37<='Quadro 1'!$G$19,'Quadro 1'!$G$19,IF($V37<='Quadro 1'!$G$20,'Quadro 1'!$G$20,IF($V37<='Quadro 1'!$G$21,'Quadro 1'!$G$21,IF($V37<='Quadro 1'!$G$22,'Quadro 1'!$G$22,IF($V37<='Quadro 1'!$G$23,'Quadro 1'!$G$23,'Quadro 1'!$G$23))))))))","v":""},{"$f":"IF(W37=\"\",\"\",LOOKUP(W37,'Quadro 1'!$G$9:$G$23,'Quadro 1'!$H$9:$H$23))","v":""},{"$f":"IF(W37=\"\",\"\",LOOKUP(W37,'Quadro 1'!$G$9:$G$23,'Quadro 1'!$D$9:$D$23))","v":""},{"$f":"IF(W37=\"\",\"\",LOOKUP(W37,'Quadro 1'!$G$9:$G$23,'Quadro 1'!$E$9:$E$23))","v":""},"","","","","","","","",null,null,null,"","",null,null,null,0,0,{"$f":"IF(AT142=\"\",AU142,IF(OR(AT142<>0,AT142<>1),AT142,AU142))","v":1},"","","","",1,"","","",1,"","","",0,0,"","","","","","","","","","","","","","","","","","","","","","","","","","0",0,"NA","","","","","","",0,"",155.1,155.1,155.1,"","","",1,"","","","","","","","","","","","","",13,"","","","","","","","","","","","","","","","","","","","","","","","","","","","","","",null,null,13,"Crítico",1,"Crítico",1,"Crítico",1,0,"","",0,0,0,0,"","",0,"","","",0,"","","",0,"","","",0,"","","",0,"","","",0,"","","",0,"","","",0,"","","",0,"","","",0,"","","",0,"","","",0,"","","",0,"","","",0,"","","",0,"","","",0,"","","",0,"","","",0,"","","",0,"","","",0,"","","",0,"","","",0,"","","",0,"","","",0]
["","","","",{"$f":"IF(DO67=\"\",\"\",SUM($DO$54:DO67))","v":""},null,null,null,null,null,null,{"$f":"IF('Quadro 2'!G26=\"\",\"\",'Quadro 2'!G26)","v":""},"","","","","","","","",null,"",{"$f":"IF(OR(H38=\"\",V38=\"\",V38=0),\"\",IF($V38>'Quadro 1'!$G$23,'Quadro 1'!$G$23,IF($V38<'Quadro 1'!$G$10,'Quadro 1'!$G$10,MIN($X38,$Y38))))","v":""},{"$f":"IF($V38<='Quadro 1'!$G$10,'Quadro 1'!$G$10,IF($V38<='Quadro 1'!$G$11,'Quadro 1'!$G$11,IF($V38<='Quadro 1'!$G$12,'Quadro 1'!$G$12,IF($V38<='Quadro 1'!$G$13,'Quadro 1'!$G$13,IF($V38<='Quadro 1'!$G$14,'Quadro 1'!$G$14,IF($V38<='Quadro 1'!$G$15,'Quadro 1'!$G$15,IF($V38<='Quadro 1'!$G$16,'Quadro 1'!$G$16,\"\")))))))","v":""},{"$f":"IF(OR(V38=\"\",V38=0),\"\",IF($V38<='Quadro 1'!$G$17,'Quadro 1'!$G$17,IF($V38<='Quadro 1'!$G$18,'Quadro 1'!$G$18,IF($V38<='Quadro 1'!$G$19,'Quadro 1'!$G$19,IF($V38<='Quadro 1'!$G$20,'Quadro 1'!$G$20,IF($V38<='Quadro 1'!$G$21,'Quadro 1'!$G$21,IF($V38<='Quadro 1'!$G$22,'Quadro 1'!$G$22,IF($V38<='Quadro 1'!$G$23,'Quadro 1'!$G$23,'Quadro 1'!$G$23))))))))","v":""},{"$f":"IF(W38=\"\",\"\",LOOKUP(W38,'Quadro 1'!$G$9:$G$23,'Quadro 1'!$H$9:$H$23))","v":""},{"$f":"IF(W38=\"\",\"\",LOOKUP(W38,'Quadro 1'!$G$9:$G$23,'Quadro 1'!$D$9:$D$23))","v":""},{"$f":"IF(W38=\"\",\"\",LOOKUP(W38,'Quadro 1'!$G$9:$G$23,'Quadro 1'!$E$9:$E$23))","v":""},"","","","","","","","",null,null,null,"","",null,null,null,0,0,{"$f":"IF(AT143=\"\",AU143,IF(OR(AT143<>0,AT143<>1),AT143,AU143))","v":1},"","","","",1,"","","",1,"","","",0,0,"","","","","","","","","","","","","","","","","","","","","","","","","","0",0,"NA","","","","","","",0,"",155.1,155.1,155.1,"","","",1,"","","","","","","","","","","","","",14,"","","","","","","","","","","","","","","","","","","","","","","","","","","","","","",null,null,14,"Crítico",1,"Crítico",1,"Crítico",1,0,"","",0,0,0,0,"","",0,"","","",0,"","","",0,"","","",0,"","","",0,"","","",0,"","","",0,"","","",0,"","","",0,"","","",0,"","","",0,"","","",0,"","","",0,"","","",0,"","","",0,"","","",0,"","","",0,"","","",0,"","","",0,"","","",0,"","","",0,"","","",0,"","","",0,"","","",0]
["","","","",{"$f":"IF(DO68=\"\",\"\",SUM($DO$54:DO68))","v":""},null,null,null,null,null,null,{"$f":"IF('Quadro 2'!G27=\"\",\"\",'Quadro 2'!G27)","v":""},"","","","","","","","",null,"",{"$f":"IF(OR(H39=\"\",V39=\"\",V39=0),\"\",IF($V39>'Quadro 1'!$G$23,'Quadro 1'!$G$23,IF($V39<'Quadro 1'!$G$10,'Quadro 1'!$G$10,MIN($X39,$Y39))))","v":""},{"$f":"IF($V39<='Quadro 1'!$G$10,'Quadro 1'!$G$10,IF($V39<='Quadro 1'!$G$11,'Quadro 1'!$G$11,IF($V39<='Quadro 1'!$G$12,'Quadro 1'!$G$12,IF($V39<='Quadro 1'!$G$13,'Quadro 1'!$G$13,IF($V39<='Quadro 1'!$G$14,'Quadro 1'!$G$14,IF($V39<='Quadro 1'!$G$15,'Quadro 1'!$G$15,IF($V39<='Quadro 1'!$G$16,'Quadro 1'!$G$16,\"\")))))))","v":""},{"$f":"IF(OR(V39=\"\",V39=0),\"\",IF($V39<='Quadro 1'!$G$17,'Quadro 1'!$G$17,IF($V39<='Quadro 1'!$G$18,'Quadro 1'!$G$18,IF($V39<='Quadro 1'!$G$19,'Quadro 1'!$G$19,IF($V39<='Quadro 1'!$G$20,'Quadro 1'!$G$20,IF($V39<='Quadro 1'!$G$21,'Quadro 1'!$G$21,IF($V39<='Quadro 1'!$G$22,'Quadro 1'!$G$22,IF($V39<='Quadro 1'!$G$23,'Quadro 1'!$G$23,'Quadro 1'!$G$23))))))))","v":""},{"$f":"IF(W39=\"\",\"\",LOOKUP(W39,'Quadro 1'!$G$9:$G$23,'Quadro 1'!$H$9:$H$23))","v":""},{"$f":"IF(W39=\"\",\"\",LOOKUP(W39,'Quadro 1'!$G$9:$G$23,'Quadro 1'!$D$9:$D$23))","v":""},{"$f":"IF(W39=\"\",\"\",LOOKUP(W39,'Quadro 1'!$G$9:$G$23,'Quadro 1'!$E$9:$E$23))","v":""},"","","","","","","","",null,null,null,"","",null,null,null,0,0,{"$f":"IF(AT144=\"\",AU144,IF(OR(AT144<>0,AT144<>1),AT144,AU144))","v":1},{"$f":"IF(F39=\"\",\"\",IF(F39=$DT$14,1,0))","v":""},"","","",1,"","","",1,"","","",0,0,"","","","","","","","","","","","","","","","","","","","","","","","","","0",0,"NA","","","","","","",0,"",155.1,155.1,155.1,"","","",1,"","","","","","","","","","","","","",15,"","","","","","","","","","","","","","","","","","","","","","","","","","","","","","",null,null,15,"Crítico",1,"Crítico",1,"Crítico",1,0,"","",0,0,0,0,"","",0,"","","",0,"","","",0,"","","",0,"","","",0,"","","",0,"","","",0,"","","",0,"","","",0,"","","",0,"","","",0,"","","",0,"","","",0,"","","",0,"","","",0,"","","",0,"","","",0,"","","",0,"","","",0,"","","",0,"","","",0,"","","",0,"","","",0,"","","",0]
["","","","",{"$f":"IF(DO69=\"\",\"\",SUM($DO$54:DO69))","v":""},null,null,null,null,null,null,{"$f":"IF('Quadro 2'!G28=\"\",\"\",'Quadro 2'!G28)","v":""},"","","","","","",{"$f":"IF(OR(R40=\"\",R40=0),\"\",\"Aço\")","v":""},"",null,"",{"$f":"IF(OR(H40=\"\",V40=\"\",V40=0),\"\",IF($V40>'Quadro 1'!$G$23,'Quadro 1'!$G$23,IF($V40<'Quadro 1'!$G$10,'Quadro 1'!$G$10,MIN($X40,$Y40))))","v":""},{"$f":"IF($V40<='Quadro 1'!$G$10,'Quadro 1'!$G$10,IF($V40<='Quadro 1'!$G$11,'Quadro 1'!$G$11,IF($V40<='Quadro 1'!$G$12,'Quadro 1'!$G$12,IF($V40<='Quadro 1'!$G$13,'Quadro 1'!$G$13,IF($V40<='Quadro 1'!$G$14,'Quadro 1'!$G$14,IF($V40<='Quadro 1'!$G$15,'Quadro 1'!$G$15,IF($V40<='Quadro 1'!$G$16,'Quadro 1'!$G$16,\"\")))))))","v":""},{"$f":"IF(OR(V40=\"\",V40=0),\"\",IF($V40<='Quadro 1'!$G$17,'Quadro 1'!$G$17,IF($V40<='Quadro 1'!$G$18,'Quadro 1'!$G$18,IF($V40<='Quadro 1'!$G$19,'Quadro 1'!$G$19,IF($V40<='Quadro 1'!$G$20,'Quadro 1'!$G$20,IF($V40<='Quadro 1'!$G$21,'Quadro 1'!$G$21,IF($V40<='Quadro 1'!$G$22,'Quadro 1'!$G$22,IF($V40<='Quadro 1'!$G$23,'Quadro 1'!$G$23,'Quadro 1'!$G$23))))))))","v":""},{"$f":"IF(W40=\"\",\"\",LOOKUP(W40,'Quadro 1'!$G$9:$G$23,'Quadro 1'!$H$9:$H$23))","v":""},{"$f":"IF(W40=\"\",\"\",LOOKUP(W40,'Quadro 1'!$G$9:$G$23,'Quadro 1'!$D$9:$D$23))","v":""},{"$f":"IF(W40=\"\",\"\",LOOKUP(W40,'Quadro 1'!$G$9:$G$23,'Quadro 1'!$E$9:$E$23))","v":""},"","","","","","","","",null,null,null,"","",null,null,null,0,0,{"$f":"IF(AT145=\"\",AU145,IF(OR(AT145<>0,AT145<>1),AT145,AU145))","v":1},"","","","",1,"","","",1,"","","",0,0,"","","","","","","","","","","","","","","","","","","","","","","","","","0",0,"NA","","","","","","",0,"",155.1,155.1,155.1,"","","",1,"","","","","","","","","","","","","",16,"","","","","","","","","","","","","","","","","","","","","","","","","","","","","","",null,null,16,"Crítico",1,"Crítico",1,"Crítico",1,0,"","",0,0,0,0,"","",0,"","","",0,"","","",0,"","","",0,"","","",0,"","","",0,"","","",0,"","","",0,"","","",0,"","","",0,"","","",0,"","","",0,"","","",0,"","","",0,"","","",0,"","","",0,"","","",0,"","","",0,"","","",0,"","","",0,"","","",0,"","","",0,"","","",0,"","","",0]
["","","","",{"$f":"IF(DO70=\"\",\"\",SUM($DO$54:DO70))","v":""},null,null,null,null,null,null,{"$f":"IF('Quadro 2'!G29=\"\",\"\",'Quadro 2'!G29)","v":""},"","","","","","","","",null,"",{"$f":"IF(OR(H41=\"\",V41=\"\",V41=0),\"\",IF($V41>'Quadro 1'!$G$23,'Quadro 1'!$G$23,IF($V41<'Quadro 1'!$G$10,'Quadro 1'!$G$10,MIN($X41,$Y41))))","v":""},{"$f":"IF($V41<='Quadro 1'!$G$10,'Quadro 1'!$G$10,IF($V41<='Quadro 1'!$G$11,'Quadro 1'!$G$11,IF($V41<='Quadro 1'!$G$12,'Quadro 1'!$G$12,IF($V41<='Quadro 1'!$G$13,'Quadro 1'!$G$13,IF($V41<='Quadro 1'!$G$14,'Quadro 1'!$G$14,IF($V41<='Quadro 1'!$G$15,'Quadro 1'!$G$15,IF($V41<='Quadro 1'!$G$16,'Quadro 1'!$G$16,\"\")))))))","v":""},{"$f":"IF(OR(V41=\"\",V41=0),\"\",IF($V41<='Quadro 1'!$G$17,'Quadro 1'!$G$17,IF($V41<='Quadro 1'!$G$18,'Quadro 1'!$G$18,IF($V41<='Quadro 1'!$G$19,'Quadro 1'!$G$19,IF($V41<='Quadro 1'!$G$20,'Quadro 1'!$G$20,IF($V41<='Quadro 1'!$G$21,'Quadro 1'!$G$21,IF($V41<='Quadro 1'!$G$22,'Quadro 1'!$G$22,IF($V41<='Quadro 1'!$G$23,'Quadro 1'!$G$23,'Quadro 1'!$G$23))))))))","v":""},{"$f":"IF(W41=\"\",\"\",LOOKUP(W41,'Quadro 1'!$G$9:$G$23,'Quadro 1'!$H$9:$H$23))","v":""},{"$f":"IF(W41=\"\",\"\",LOOKUP(W41,'Quadro 1'!$G$9:$G$23,'Quadro 1'!$D$9:$D$23))","v":""},{"$f":"IF(W41=\"\",\"\",LOOKUP(W41,'Quadro 1'!$G$9:$G$23,'Quadro 1'!$E$9:$E$23))","v":""},"","","","","","","","",null,null,null,"","",null,null,null,0,0,{"$f":"IF(AT146=\"\",AU146,IF(OR(AT146<>0,AT146<>1),AT146,AU146))","v":1},"","","","",1,"","","",1,"","","",0,0,"","","","","","","","","","","","","","","","","","","","","","","","","","0",0,"NA","","","","","","",0,"",155.1,155.1,155.1,"","","",1,"","","","","","","","","","","","","",17,"","","","","","","","","","","","","","","","","","","","","","","","","","","","","","",null,null,17,"Crítico",1,"Crítico",1,"Crítico",1,0,"","",0,0,0,0,"","",0,"","","",0,"","","",0,"","","",0,"","","",0,"","","",0,"","","",0,"","","",0,"","","",0,"","","",0,"","","",0,"","","",0,"","","",0,"","","",0,"","","",0,"","","",0,"","","",0,"","","",0,"","","",0,"","","",0,"","","",0,"","","",0,"","","",0,"","","",0]
["","","","",{"$f":"IF(DO71=\"\",\"\",SUM($DO$54:DO71))","v":""},null,null,null,null,null,null,{"$f":"IF('Quadro 2'!G30=\"\",\"\",'Quadro 2'!G30)","v":""},"","","","","","","","",null,"",{"$f":"IF(OR(H42=\"\",V42=\"\",V42=0),\"\",IF($V42>'Quadro 1'!$G$23,'Quadro 1'!$G$23,IF($V42<'Quadro 1'!$G$10,'Quadro 1'!$G$10,MIN($X42,$Y42))))","v":""},{"$f":"IF($V42<='Quadro 1'!$G$10,'Quadro 1'!$G$10,IF($V42<='Quadro 1'!$G$11,'Quadro 1'!$G$11,IF($V42<='Quadro 1'!$G$12,'Quadro 1'!$G$12,IF($V42<='Quadro 1'!$G$13,'Quadro 1'!$G$13,IF($V42<='Quadro 1'!$G$14,'Quadro 1'!$G$14,IF($V42<='Quadro 1'!$G$15,'Quadro 1'!$G$15,IF($V42<='Quadro 1'!$G$16,'Quadro 1'!$G$16,\"\")))))))","v":""},{"$f":"IF(OR(V42=\"\",V42=0),\"\",IF($V42<='Quadro 1'!$G$17,'Quadro 1'!$G$17,IF($V42<='Quadro 1'!$G$18,'Quadro 1'!$G$18,IF($V42<='Quadro 1'!$G$19,'Quadro 1'!$G$19,IF($V42<='Quadro 1'!$G$20,'Quadro 1'!$G$20,IF($V42<='Quadro 1'!$G$21,'Quadro 1'!$G$21,IF($V42<='Quadro 1'!$G$22,'Quadro 1'!$G$22,IF($V42<='Quadro 1'!$G$23,'Quadro 1'!$G$23,'Quadro 1'!$G$23))))))))","v":""},{"$f":"IF(W42=\"\",\"\",LOOKUP(W42,'Quadro 1'!$G$9:$G$23,'Quadro 1'!$H$9:$H$23))","v":""},{"$f":"IF(W42=\"\",\"\",LOOKUP(W42,'Quadro 1'!$G$9:$G$23,'Quadro 1'!$D$9:$D$23))","v":""},{"$f":"IF(W42=\"\",\"\",LOOKUP(W42,'Quadro 1'!$G$9:$G$23,'Quadro 1'!$E$9:$E$23))","v":""},"","","","","","","","",null,null,null,"","",null,null,null,0,0,1,"","","","",1,"","","",1,"","","",0,0,"","","","","","","","","","","","","","","","","","","","","","","","","","0",0,"NA","","","","","","",0,"",155.1,155.1,155.1,"","","",1,"","","","","","","","","","","","","",18,"","","","","","","","","","","","","","","","","","","","","","","","","","","","","","",null,null,18,"Crítico",1,"Crítico",1,"Crítico",1,0,"","",0,0,0,0,"","",0,"","","",0,"","","",0,"","","",0,"","","",0,"","","",0,"","","",0,"","","",0,"","","",0,"","","",0,"","","",0,"","","",0,"","","",0,"","","",0,"","","",0,"","","",0,"","","",0,"","","",0,"","","",0,"","","",0,"","","",0,"","","",0,"","","",0,"","","",0]
["","","","",{"$f":"IF(DO72=\"\",\"\",SUM($DO$54:DO72))","v":""},null,null,null,null,null,null,{"$f":"IF('Quadro 2'!G31=\"\",\"\",'Quadro 2'!G31)","v":""},"","","","","","","","",null,"",{"$f":"IF(OR(H43=\"\",V43=\"\",V43=0),\"\",IF($V43>'Quadro 1'!$G$23,'Quadro 1'!$G$23,IF($V43<'Quadro 1'!$G$10,'Quadro 1'!$G$10,MIN($X43,$Y43))))","v":""},{"$f":"IF($V43<='Quadro 1'!$G$10,'Quadro 1'!$G$10,IF($V43<='Quadro 1'!$G$11,'Quadro 1'!$G$11,IF($V43<='Quadro 1'!$G$12,'Quadro 1'!$G$12,IF($V43<='Quadro 1'!$G$13,'Quadro 1'!$G$13,IF($V43<='Quadro 1'!$G$14,'Quadro 1'!$G$14,IF($V43<='Quadro 1'!$G$15,'Quadro 1'!$G$15,IF($V43<='Quadro 1'!$G$16,'Quadro 1'!$G$16,\"\")))))))","v":""},{"$f":"IF(OR(V43=\"\",V43=0),\"\",IF($V43<='Quadro 1'!$G$17,'Quadro 1'!$G$17,IF($V43<='Quadro 1'!$G$18,'Quadro 1'!$G$18,IF($V43<='Quadro 1'!$G$19,'Quadro 1'!$G$19,IF($V43<='Quadro 1'!$G$20,'Quadro 1'!$G$20,IF($V43<='Quadro 1'!$G$21,'Quadro 1'!$G$21,IF($V43<='Quadro 1'!$G$22,'Quadro 1'!$G$22,IF($V43<='Quadro 1'!$G$23,'Quadro 1'!$G$23,'Quadro 1'!$G$23))))))))","v":""},{"$f":"IF(W43=\"\",\"\",LOOKUP(W43,'Quadro 1'!$G$9:$G$23,'Quadro 1'!$H$9:$H$23))","v":""},{"$f":"IF(W43=\"\",\"\",LOOKUP(W43,'Quadro 1'!$G$9:$G$23,'Quadro 1'!$D$9:$D$23))","v":""},{"$f":"IF(W43=\"\",\"\",LOOKUP(W43,'Quadro 1'!$G$9:$G$23,'Quadro 1'!$E$9:$E$23))","v":""},"","","","","","","","",null,null,null,"","",null,null,null,0,0,1,"","","","",1,"","","",1,"","","",0,0,"","","","","","","","","","","","","","","","","","","","","","","","","","0",0,"NA","","","","","","",0,"",155.1,155.1,155.1,"","","",1,"","","","","","","","","","","","","",19,"","","","","","","","","","","","","","","","","","","","","","","","","","","","","","",null,null,19,"Crítico",1,"Crítico",1,"Crítico",1,0,"","",0,0,0,0,"","",0,"","","",0,"","","",0,"","","",0,"","","",0,"","","",0,"","","",0,"","","",0,"","","",0,"","","",0,"","","",0,"","","",0,"","","",0,"","","",0,"","","",0,"","","",0,"","","",0,"","","",0,"","","",0,"","","",0,"","","",0,"","","",0,"","","",0,"","","",0]
["","","","",{"$f":"IF(DO73=\"\",\"\",SUM($DO$54:DO73))","v":""},null,null,null,null,null,null,{"$f":"IF('Quadro 2'!G32=\"\",\"\",'Quadro 2'!G32)","v":""},"","","","","","","","",null,"",{"$f":"IF(OR(H44=\"\",V44=\"\",V44=0),\"\",IF($V44>'Quadro 1'!$G$23,'Quadro 1'!$G$23,IF($V44<'Quadro 1'!$G$10,'Quadro 1'!$G$10,MIN($X44,$Y44))))","v":""},{"$f":"IF($V44<='Quadro 1'!$G$10,'Quadro 1'!$G$10,IF($V44<='Quadro 1'!$G$11,'Quadro 1'!$G$11,IF($V44<='Quadro 1'!$G$12,'Quadro 1'!$G$12,IF($V44<='Quadro 1'!$G$13,'Quadro 1'!$G$13,IF($V44<='Quadro 1'!$G$14,'Quadro 1'!$G$14,IF($V44<='Quadro 1'!$G$15,'Quadro 1'!$G$15,IF($V44<='Quadro 1'!$G$16,'Quadro 1'!$G$16,\"\")))))))","v":""},{"$f":"IF(OR(V44=\"\",V44=0),\"\",IF($V44<='Quadro 1'!$G$17,'Quadro 1'!$G$17,IF($V44<='Quadro 1'!$G$18,'Quadro 1'!$G$18,IF($V44<='Quadro 1'!$G$19,'Quadro 1'!$G$19,IF($V44<='Quadro 1'!$G$20,'Quadro 1'!$G$20,IF($V44<='Quadro 1'!$G$21,'Quadro 1'!$G$21,IF($V44<='Quadro 1'!$G$22,'Quadro 1'!$G$22,IF($V44<='Quadro 1'!$G$23,'Quadro 1'!$G$23,'Quadro 1'!$G$23))))))))","v":""},{"$f":"IF(W44=\"\",\"\",LOOKUP(W44,'Quadro 1'!$G$9:$G$23,'Quadro 1'!$H$9:$H$23))","v":""},{"$f":"IF(W44=\"\",\"\",LOOKUP(W44,'Quadro 1'!$G$9:$G$23,'Quadro 1'!$D$9:$D$23))","v":""},{"$f":"IF(W44=\"\",\"\",LOOKUP(W44,'Quadro 1'!$G$9:$G$23,'Quadro 1'!$E$9:$E$23))","v":""},"","","","","","","","",null,null,null,"","",null,null,null,0,0,1,"","","","",1,"","","",1,"","","",0,0,"","","","","","","","","","","","","","","","","","","","","","","","","","0",0,"NA","","","","","","",0,"",155.1,155.1,155.1,"","","",1,"","",{"$f":"IF(DK44<>\"\",DK44,IF(DL44<>\"\",DL44,IF(DM44<>\"\",DM44,\"\")))","v":""},"","","",{"$f":"IF(OR($DT44=\"\",$AU$105=\"\",COUNTIF($DT44:$ER44,$AU$105)=0),\"\",LOOKUP(MATCH($AU$105,$DT44:$ER44,0),$DT$24:$ER$24,$DT44:$ER44))","v":""},"","","","","","",20,"","","","","","","","","","","","","","","","","","","","","","","","","","","","","","",null,null,20,"Crítico",1,"Crítico",1,"Crítico",1,0,"","",0,0,0,0,"","",0,"","","",0,"","","",0,"","","",0,"","","",0,"","","",0,"","","",0,"","","",0,"","","",0,"","","",0,"","","",0,"","","",0,"","","",0,"","","",0,"","","",0,"","","",0,"","","",0,"","","",0,"","","",0,"","","",0,"","","",0,"","","",0,"","","",0,"","","",0]
["","","","",{"$f":"IF(DO74=\"\",\"\",SUM($DO$54:DO74))","v":""},null,null,null,null,null,null,{"$f":"IF('Quadro 2'!G33=\"\",\"\",'Quadro 2'!G33)","v":""},"","","","","","","","",null,"",{"$f":"IF(OR(H45=\"\",V45=\"\",V45=0),\"\",IF($V45>'Quadro 1'!$G$23,'Quadro 1'!$G$23,IF($V45<'Quadro 1'!$G$10,'Quadro 1'!$G$10,MIN($X45,$Y45))))","v":""},{"$f":"IF($V45<='Quadro 1'!$G$10,'Quadro 1'!$G$10,IF($V45<='Quadro 1'!$G$11,'Quadro 1'!$G$11,IF($V45<='Quadro 1'!$G$12,'Quadro 1'!$G$12,IF($V45<='Quadro 1'!$G$13,'Quadro 1'!$G$13,IF($V45<='Quadro 1'!$G$14,'Quadro 1'!$G$14,IF($V45<='Quadro 1'!$G$15,'Quadro 1'!$G$15,IF($V45<='Quadro 1'!$G$16,'Quadro 1'!$G$16,\"\")))))))","v":""},{"$f":"IF(OR(V45=\"\",V45=0),\"\",IF($V45<='Quadro 1'!$G$17,'Quadro 1'!$G$17,IF($V45<='Quadro 1'!$G$18,'Quadro 1'!$G$18,IF($V45<='Quadro 1'!$G$19,'Quadro 1'!$G$19,IF($V45<='Quadro 1'!$G$20,'Quadro 1'!$G$20,IF($V45<='Quadro 1'!$G$21,'Quadro 1'!$G$21,IF($V45<='Quadro 1'!$G$22,'Quadro 1'!$G$22,IF($V45<='Quadro 1'!$G$23,'Quadro 1'!$G$23,'Quadro 1'!$G$23))))))))","v":""},{"$f":"IF(W45=\"\",\"\",LOOKUP(W45,'Quadro 1'!$G$9:$G$23,'Quadro 1'!$H$9:$H$23))","v":""},{"$f":"IF(W45=\"\",\"\",LOOKUP(W45,'Quadro 1'!$G$9:$G$23,'Quadro 1'!$D$9:$D$23))","v":""},{"$f":"IF(W45=\"\",\"\",LOOKUP(W45,'Quadro 1'!$G$9:$G$23,'Quadro 1'!$E$9:$E$23))","v":""},"","","","","","","","",null,null,null,"","",null,null,null,0,0,1,"","","","",1,"","","",1,"","","",0,0,"","","","","","","","","","","","","","","","","","","","","","","","","","0",0,"NA","","","","","","",0,"",155.1,155.1,155.1,"","","",1,"","","","","","","","","","","","","",21,"","","","","","","","","","","","","","","","","","","","","","","","","","","","","","",null,null,21,"Crítico",1,"Crítico",1,"Crítico",1,0,"","",0,0,0,0,"","",0,"","","",0,"","","",0,"","","",0,"","","",0,"","","",0,"","","",0,"","","",0,"","","",0,"","","",0,"","","",0,"","","",0,"","","",0,"","","",0,"","","",0,"","","",0,"","","",0,"","","",0,"","","",0,"","","",0,"","","",0,"","","",0,"","","",0,"","","",0]
["","","","",{"$f":"IF(DO75=\"\",\"\",SUM($DO$54:DO75))","v":""},null,null,null,null,null,null,{"$f":"IF('Quadro 2'!G34=\"\",\"\",'Quadro 2'!G34)","v":""},"","","","","","","","",null,"",{"$f":"IF(OR(H46=\"\",V46=\"\",V46=0),\"\",IF($V46>'Quadro 1'!$G$23,'Quadro 1'!$G$23,IF($V46<'Quadro 1'!$G$10,'Quadro 1'!$G$10,MIN($X46,$Y46))))","v":""},{"$f":"IF($V46<='Quadro 1'!$G$10,'Quadro 1'!$G$10,IF($V46<='Quadro 1'!$G$11,'Quadro 1'!$G$11,IF($V46<='Quadro 1'!$G$12,'Quadro 1'!$G$12,IF($V46<='Quadro 1'!$G$13,'Quadro 1'!$G$13,IF($V46<='Quadro 1'!$G$14,'Quadro 1'!$G$14,IF($V46<='Quadro 1'!$G$15,'Quadro 1'!$G$15,IF($V46<='Quadro 1'!$G$16,'Quadro 1'!$G$16,\"\")))))))","v":""},{"$f":"IF(OR(V46=\"\",V46=0),\"\",IF($V46<='Quadro 1'!$G$17,'Quadro 1'!$G$17,IF($V46<='Quadro 1'!$G$18,'Quadro 1'!$G$18,IF($V46<='Quadro 1'!$G$19,'Quadro 1'!$G$19,IF($V46<='Quadro 1'!$G$20,'Quadro 1'!$G$20,IF($V46<='Quadro 1'!$G$21,'Quadro 1'!$G$21,IF($V46<='Quadro 1'!$G$22,'Quadro 1'!$G$22,IF($V46<='Quadro 1'!$G$23,'Quadro 1'!$G$23,'Quadro 1'!$G$23))))))))","v":""},{"$f":"IF(W46=\"\",\"\",LOOKUP(W46,'Quadro 1'!$G$9:$G$23,'Quadro 1'!$H$9:$H$23))","v":""},{"$f":"IF(W46=\"\",\"\",LOOKUP(W46,'Quadro 1'!$G$9:$G$23,'Quadro 1'!$D$9:$D$23))","v":""},{"$f":"IF(W46=\"\",\"\",LOOKUP(W46,'Quadro 1'!$G$9:$G$23,'Quadro 1'!$E$9:$E$23))","v":""},"","","","","","","","",null,null,null,"","",null,null,null,0,0,1,"","","","",1,"","","",1,"","","",0,0,"","","","","","","","","","","","","","","","","","","","","","","","","","0",0,"NA","","","","","","",0,"",155.1,155.1,155.1,"","","",1,"","","","","","","","","","","","","",22,"","","","","","","","","","","","","","","","","","","","","","","","","","","","","","",null,null,22,"Crítico",1,"Crítico",1,"Crítico",1,0,"","",0,0,0,0,"","",0,"","","",0,"","","",0,"","","",0,"","","",0,"","","",0,"","","",0,"","","",0,"","","",0,"","","",0,"","","",0,"","","",0,"","","",0,"","","",0,"","","",0,"","","",0,"","","",0,"","","",0,"","","",0,"","","",0,"","","",0,"","","",0,"","","",0,"","","",0]
["","","","",{"$f":"IF(DO76=\"\",\"\",SUM($DO$54:DO76))","v":""},null,null,null,null,null,null,{"$f":"IF('Quadro 2'!G35=\"\",\"\",'Quadro 2'!G35)","v":""},"","","","","","","","",null,"",{"$f":"IF(OR(H47=\"\",V47=\"\",V47=0),\"\",IF($V47>'Quadro 1'!$G$23,'Quadro 1'!$G$23,IF($V47<'Quadro 1'!$G$10,'Quadro 1'!$G$10,MIN($X47,$Y47))))","v":""},{"$f":"IF($V47<='Quadro 1'!$G$10,'Quadro 1'!$G$10,IF($V47<='Quadro 1'!$G$11,'Quadro 1'!$G$11,IF($V47<='Quadro 1'!$G$12,'Quadro 1'!$G$12,IF($V47<='Quadro 1'!$G$13,'Quadro 1'!$G$13,IF($V47<='Quadro 1'!$G$14,'Quadro 1'!$G$14,IF($V47<='Quadro 1'!$G$15,'Quadro 1'!$G$15,IF($V47<='Quadro 1'!$G$16,'Quadro 1'!$G$16,\"\")))))))","v":""},{"$f":"IF(OR(V47=\"\",V47=0),\"\",IF($V47<='Quadro 1'!$G$17,'Quadro 1'!$G$17,IF($V47<='Quadro 1'!$G$18,'Quadro 1'!$G$18,IF($V47<='Quadro 1'!$G$19,'Quadro 1'!$G$19,IF($V47<='Quadro 1'!$G$20,'Quadro 1'!$G$20,IF($V47<='Quadro 1'!$G$21,'Quadro 1'!$G$21,IF($V47<='Quadro 1'!$G$22,'Quadro 1'!$G$22,IF($V47<='Quadro 1'!$G$23,'Quadro 1'!$G$23,'Quadro 1'!$G$23))))))))","v":""},{"$f":"IF(W47=\"\",\"\",LOOKUP(W47,'Quadro 1'!$G$9:$G$23,'Quadro 1'!$H$9:$H$23))","v":""},{"$f":"IF(W47=\"\",\"\",LOOKUP(W47,'Quadro 1'!$G$9:$G$23,'Quadro 1'!$D$9:$D$23))","v":""},{"$f":"IF(W47=\"\",\"\",LOOKUP(W47,'Quadro 1'!$G$9:$G$23,'Quadro 1'!$E$9:$E$23))","v":""},"","","","","","","","",null,null,null,"","",null,null,null,0,0,1,"","","","",1,"","","",1,"","","",0,0,"","","","","","","","","","","","","","","","","","","","","","","","","","0",0,"NA","","","","","","",0,"",155.1,155.1,155.1,"","","",1,"","","","","","","","","","","","","",23,"","","","","","","","","","","","","","","","","","","","","","","","","","","","","","",null,null,23,"Crítico",1,"Crítico",1,"Crítico",1,0,"","",0,0,0,0,"","",0,"","","",0,"","","",0,"","","",0,"","","",0,"","","",0,"","","",0,"","","",0,"","","",0,"","","",0,"","","",0,"","","",0,"","","",0,"","","",0,"","","",0,"","","",0,"","","",0,"","","",0,"","","",0,"","","",0,"","","",0,"","","",0,"","","",0,"","","",0]
["","","","",{"$f":"IF(DO77=\"\",\"\",SUM($DO$54:DO77))","v":""},null,null,null,null,null,null,{"$f":"IF('Quadro 2'!G36=\"\",\"\",'Quadro 2'!G36)","v":""},"","","","","","","","",null,"",{"$f":"IF(OR(H48=\"\",V48=\"\",V48=0),\"\",IF($V48>'Quadro 1'!$G$23,'Quadro 1'!$G$23,IF($V48<'Quadro 1'!$G$10,'Quadro 1'!$G$10,MIN($X48,$Y48))))","v":""},{"$f":"IF($V48<='Quadro 1'!$G$10,'Quadro 1'!$G$10,IF($V48<='Quadro 1'!$G$11,'Quadro 1'!$G$11,IF($V48<='Quadro 1'!$G$12,'Quadro 1'!$G$12,IF($V48<='Quadro 1'!$G$13,'Quadro 1'!$G$13,IF($V48<='Quadro 1'!$G$14,'Quadro 1'!$G$14,IF($V48<='Quadro 1'!$G$15,'Quadro 1'!$G$15,IF($V48<='Quadro 1'!$G$16,'Quadro 1'!$G$16,\"\")))))))","v":""},{"$f":"IF(OR(V48=\"\",V48=0),\"\",IF($V48<='Quadro 1'!$G$17,'Quadro 1'!$G$17,IF($V48<='Quadro 1'!$G$18,'Quadro 1'!$G$18,IF($V48<='Quadro 1'!$G$19,'Quadro 1'!$G$19,IF($V48<='Quadro 1'!$G$20,'Quadro 1'!$G$20,IF($V48<='Quadro 1'!$G$21,'Quadro 1'!$G$21,IF($V48<='Quadro 1'!$G$22,'Quadro 1'!$G$22,IF($V48<='Quadro 1'!$G$23,'Quadro 1'!$G$23,'Quadro 1'!$G$23))))))))","v":""},{"$f":"IF(W48=\"\",\"\",LOOKUP(W48,'Quadro 1'!$G$9:$G$23,'Quadro 1'!$H$9:$H$23))","v":""},{"$f":"IF(W48=\"\",\"\",LOOKUP(W48,'Quadro 1'!$G$9:$G$23,'Quadro 1'!$D$9:$D$23))","v":""},{"$f":"IF(W48=\"\",\"\",LOOKUP(W48,'Quadro 1'!$G$9:$G$23,'Quadro 1'!$E$9:$E$23))","v":""},"","","","","","","","",null,null,null,"","",null,null,null,0,0,1,"","","","",1,"","","",1,"","","",0,0,"","","","","","","","","","","","","","","","","","","","","","","","","","0",0,"NA","","","","","","",0,"",155.1,155.1,155.1,"","","",1,"","","","","","","","","","","","","",24,"","","","","","","","","","","","","","","","","","","","","","","","","","","","","","",null,null,24,"Crítico",1,"Crítico",1,"Crítico",1,0,"","",0,0,0,0,"","",0,"","","",0,"","","",0,"","","",0,"","","",0,"","","",0,"","","",0,"","","",0,"","","",0,"","","",0,"","","",0,"","","",0,"","","",0,"","","",0,"","","",0,"","","",0,"","","",0,"","","",0,"","","",0,"","","",0,"","","",0,"","","",0,"","","",0,"","","",0]
["","","","",{"$f":"IF(DO78=\"\",\"\",SUM($DO$54:DO78))","v":""},null,null,null,null,null,null,{"$f":"IF('Quadro 2'!G37=\"\",\"\",'Quadro 2'!G37)","v":""},"","","","","","","","",null,"",{"$f":"IF(OR(H49=\"\",V49=\"\",V49=0),\"\",IF($V49>'Quadro 1'!$G$23,'Quadro 1'!$G$23,IF($V49<'Quadro 1'!$G$10,'Quadro 1'!$G$10,MIN($X49,$Y49))))","v":""},{"$f":"IF($V49<='Quadro 1'!$G$10,'Quadro 1'!$G$10,IF($V49<='Quadro 1'!$G$11,'Quadro 1'!$G$11,IF($V49<='Quadro 1'!$G$12,'Quadro 1'!$G$12,IF($V49<='Quadro 1'!$G$13,'Quadro 1'!$G$13,IF($V49<='Quadro 1'!$G$14,'Quadro 1'!$G$14,IF($V49<='Quadro 1'!$G$15,'Quadro 1'!$G$15,IF($V49<='Quadro 1'!$G$16,'Quadro 1'!$G$16,\"\")))))))","v":""},{"$f":"IF(OR(V49=\"\",V49=0),\"\",IF($V49<='Quadro 1'!$G$17,'Quadro 1'!$G$17,IF($V49<='Quadro 1'!$G$18,'Quadro 1'!$G$18,IF($V49<='Quadro 1'!$G$19,'Quadro 1'!$G$19,IF($V49<='Quadro 1'!$G$20,'Quadro 1'!$G$20,IF($V49<='Quadro 1'!$G$21,'Quadro 1'!$G$21,IF($V49<='Quadro 1'!$G$22,'Quadro 1'!$G$22,IF($V49<='Quadro 1'!$G$23,'Quadro 1'!$G$23,'Quadro 1'!$G$23))))))))","v":""},{"$f":"IF(W49=\"\",\"\",LOOKUP(W49,'Quadro 1'!$G$9:$G$23,'Quadro 1'!$H$9:$H$23))","v":""},{"$f":"IF(W49=\"\",\"\",LOOKUP(W49,'Quadro 1'!$G$9:$G$23,'Quadro 1'!$D$9:$D$23))","v":""},{"$f":"IF(W49=\"\",\"\",LOOKUP(W49,'Quadro 1'!$G$9:$G$23,'Quadro 1'!$E$9:$E$23))","v":""},"","","","","","","","",null,null,null,"","",null,null,null,0,0,1,"","","","",1,"","","",1,"","","",0,0,"","","","","","","","","","","","","","","","","","","","","","","","","","0",0,"NA","","","","","","",0,"",155.1,155.1,155.1,"","","",1,"","","","","","","","","","","","","",25,"","","","","","","","","","","","","","","","","","","","","","","","","","","","","","",null,null,25,"Crítico",1,"Crítico",1,"Crítico",1,0,"","",0,0,0,0,"","",0,"","","",0,"","","",0,"","","",0,"","","",0,"","","",0,"","","",0,"","","",0,"","","",0,"","","",0,"","","",0,"","","",0,"","","",0,"","","",0,"","","",0,"","","",0,"","","",0,"","","",0,"","","",0,"","","",0,"","","",0,"","","",0,"","","",0,"","","",0]
[null,null,null,null,null,null,null,null,null,null,null,null,null,null,null,null,null,null,null,"",{"$f":"IF($CI$24=\"\",\"\",\"Atenção: o diâmetro do troço assinalado a vermelho tem de ser superior ou igual ao do troço a jusante.\")","v":""},null,null,null,null,null,null,null,null,null,null,null,null,null,null,null,null,null,null,null,null,null,null,null,null,null,null,null,null,null,null,null,null,null,null,null,null,null,null,null,null,null,null,null,null,null,null,null,null,null,null,null,null,null,null,null,null,null,null,null,null,null,null,null,null,null,null,null,null,null,null,null,null,null,{"$f":"SUM(CQ25:CQ49)","v":0},{"$f":"SUM(CR25:CR49)","v":0},null,null,null,null,null,null,null,null,null,null,null,null,null,null,null,null,null,null,null,null,null,null,null,null,null,null,{"$f":"IF(OR(DT9=\"\",DT9=0),\"\",COUNTIF($DT$25:$ER$49,DT9))","v":""},null,null,null,null,null,null,null,null,null,null,null,null,null,null,null,null,null,null,null,null,null,null,null,null,null,null,null,null,"Total:",{"$f":"SUM(EW25:EW49)","v":25},"Total:",{"$f":"SUM(EY25:EY49)","v":25},"Total:",{"$f":"SUM(FA25:FA49)","v":25},{"$f":"MAX(FB25:FB49)","v":0},null,{"$f":"SUM(FD25:FD49)","v":0}]
[null,null,null,null,null,null,null,null,{"$f":"IF(OR(I52=0,I52=\"\"),\"\",\"    Síntese do consumo de tubos de aço - tubagem de compressão:\")","v":""},null,null,null,null,null,null,null,null,null,null,null,null,null,null,null,null,null,null,null,null,null,null,null,null,null,null,null,null,null,null,null,null,null,null,null,null,null,null,null,null,"Nº de sprinklers cálculo alim. em simultâneo do Sub-ramal 1 e pertencentes ao caminho crítico","Nº de Sub-ramais simultâneos com caudais determinados directamemte",null,null,null,null,null,null,null,null,null,null,null,null,null,null,null,null,null,null,null,null,null,null,null,null,null,null,null,null,null,null,null,null,null,null,null,null,null,null,null,null,null,null,null,null,null,null,null,null,null,null,null,null,null,null,null,null,null,null,null,null,null,null,null,null,null,null,null,null,null,null,null,null,null,null,null,null,null,null,null,null,null,null,null,null,null,null,null,null,null,null,null,null,null,null,null,null,null,"Situação de Bifurcação",null,null,{"$f":"IF(EU53=\"\",\"\",INDEX(DS54:DS78,EW53))","v":""},{"$f":"IF(EW52=0,\"\",SUMIF($EV$54:$EV$78,EV51,$EW$54:$EW$78))","v":""},"Inclusão da bifurcação nos Caudais de cálculo",null,null,null,null,null,null,10,null,{"$f":"FG22","v":1},null,{"$f":"FG51+1","v":2},null,null,{"$f":"FI51+1","v":3},null,null,null,{"$f":"FL51+1","v":4},null,null,null,{"$f":"FP51+1","v":5},null,null,null,{"$f":"FT51+1","v":6},null,null,null,{"$f":"FX51+1","v":7},null,null,null,{"$f":"GB51+1","v":8},null,null,null,{"$f":"GF51+1","v":9},null,null,null,{"$f":"GJ51+1","v":10},null,null,null,{"$f":"GN51+1","v":11},null,null,null,{"$f":"GR51+1","v":12},null,null,null,{"$f":"GV51+1","v":13},null,null,null,{"$f":"GZ51+1","v":14},null,null,null,{"$f":"HD51+1","v":15},null,null,null,{"$f":"HH51+1","v":16},null,null,null,{"$f":"HL51+1","v":17},null,null,null,{"$f":"HP51+1","v":18},null,null,null,{"$f":"HT51+1","v":19},null,null,null,{"$f":"HX51+1","v":20},null,null,null,{"$f":"IB51+1","v":21},null,null,null,{"$f":"IF51+1","v":22},null,null,null,{"$f":"IJ51+1","v":23},null,null,null,{"$f":"IN51+1","v":24},null,null,null,{"$f":"IR51+1","v":25}]
[null,null,null,null,null,null,null,null,{"$f":"IF(OR($EC111=\"\",$EC111=0),\"\",$EC111)","v":""},{"$f":"IF(OR($EC111=\"\",$EC111=0),\"\",ED111)","v":""},{"$f":"IF(OR($EC111=\"\",$EC111=0),\"\",\"- Tubo de aço série M (\"&EB111&\")\")","v":""},null,null,null,null,{"$f":"IF(OR($EC117=\"\",$EC117=0),\"\",$EC117)","v":""},{"$f":"IF(OR($EC117=\"\",$EC117=0),\"\",ED117)","v":""},{"$f":"IF(OR($EC117=\"\",$EC117=0),\"\",\"- Tubo de aço série M (\"&EB117&\")\")","v":""},null,null,null,null,null,null,null,null,null,null,null,null,null,null,null,null,null,null,null,null,null,null,null,null,null,null,null,"Bifurcações",null,null,null,{"$f":"IF(AND($FB$53<>\"\",MAX($AX$54:$AX$78)<=$AU$7),MAX($AX$54:$AX$78),$AU$7)","v":4},{"$f":"IF(OR(AX52=\"\",AY53=\"\"),\"\",IF(AX52=0,\"\",AY53/AX52))","v":""},null,null,"Posição da bifurcação","Nº de Nós",null,null,null,null,"Nº de sprinklers cálculo alim. em simultâneo","Localização de Extremos da Instalação (valor 1 significa que é um extremo).",null,null,null,null,null,null,null,null,null,null,null,null,null,null,null,null,null,null,null,null,null,null,null,null,null,null,null,null,null,null,null,null,null,null,"Verif.",null,null,"Quadro 5",null,null,null,null,null,null,null,null,null,null,null,null,null,null,{"$f":"IF(AND(AU6=\"\",AU7=\"\"),\"\",IF(AND(MAX(H25:H49)<>P8,MAX(H25:H49)<>AU6,DM53>MIN(2*(AU6/AU7),2*AU7),DJ53<>0,DK53=1),\"\",IF(AND($DJ$53+$DK$53>0,MAX(H25:H49)<=AU6),1,\"\")))","v":""},"Verificação do correcto preenchimento sa coluna de nº de sprinklers simultâneos","Identificação da bifurcação que alimenta todos os ramais simultâneos","Activo para análise de bifurcações relevantes","Nº","Identificação dos troços activos",null,null,null,"Nó","Nó Final",null,null,null,null,null,null,null,null,null,null,null,null,null,null,null,null,null,null,null,null,null,null,null,null,"que alimenta todos os sub-ramais simultâneos",null,null,null,{"$f":"IF(MAX(EW54:EW78)=0,0,MAX(EW54:EW78))","v":0},"Qtroço","Ident. de trajectos com Caudal a incluir",null,{"$f":"IF($FB$54<>\"\",$FB$54,IF($FB$55<>\"\",$FB$55,IF($FB$56<>\"\",$FB$56,IF($FB$57<>\"\",$FB$57,IF($FB$58<>\"\",$FB$58,IF($FB$59<>\"\",$FB$59,IF($FB$60<>\"\",$FB$60,\"\")))))))","v":""},{"$f":"IF($FB$68<>\"\",$FB$68,IF($FB$69<>\"\",$FB$69,IF($FB$70<>\"\",$FB$70,IF($FB$71<>\"\",$FB$71,IF($FB$72<>\"\",$FB$72,IF($FB$73<>\"\",$FB$73,\"\"))))))","v":""},{"$f":"IF($FB$74<>\"\",$FB$74,IF($FB$75<>\"\",$FB$75,IF($FB$76<>\"\",$FB$76,IF($FB$77<>\"\",$FB$77,IF($FB$78<>\"\",$FB$78,\"\")))))","v":""},"Caudal","QS/sub-ramal","Nó Inicial","Nó Final","Nó seguinte",null,null,"Troço",null,"Nó seguinte",null,"Troço",null,"Nó seguinte",null,"Troço",null,"Nó seguinte",null,"Troço",null,"Nó seguinte",null,"Troço",null,"Nó seguinte",null,"Troço",null,"Nó seguinte",null,"Troço",null,"Nó seguinte",null,"Troço",null,"Nó seguinte",null,"Troço",null,"Nó seguinte",null,"Troço",null,"Nó seguinte",null,"Troço",null,"Nó seguinte",null,"Troço",null,"Nó seguinte",null,"Troço",null,"Nó seguinte",null,"Troço",null,"Nó seguinte",null,"Troço",null,"Nó seguinte",null,"Troço",null,"Nó seguinte",null,"Troço",null,"Nó seguinte",null,"Troço",null,"Nó seguinte",null,"Troço",null,"Nó seguinte",null,"Troço",null,"Nó seguinte",null,"Troço",null,"Nó seguinte",null,"Troço",null,"Nó seguinte",null,"Troço",null,"Nó seguinte",null,"Troço"]
[null,null,null,null,null,null,null,null,"","",{"$f":"IF(OR($EC112=\"\",$EC112=0),\"\",\"- Tubo de aço série M (\"&EB112&\")\")","v":""},null,null,null,null,"","","",null,null,null,null,null,null,null,null,null,null,null,null,null,null,null,null,null,null,null,null,null,null,null,null,null,null,null,"Pressão Inicial",null,null,null,null,{"$f":"IF($EV$53<>\"\",MAX($AY$54:$AY$78),\"\")","v":""},"Início","Fim",null,null,null,null,"Selecção de caudais intermédios a considerar",null,null,null,1,2,3,4,5,6,7,8,9,10,11,12,13,14,15,16,17,18,19,20,21,22,23,24,25,null,null,null,null,null,null,null,null,null,"Perda Carga",null,null,"EN 12845",null,null,null,null,null,null,null,null,null,null,null,null,null,null,{"$f":"IF(MAX(DJ54:DJ78)=0,0,MAX(DJ54:DJ78))","v":0},{"$f":"IF(MAX(DK54:DK78)=0,0,MAX(DK54:DK78))","v":0},null,{"$f":"IF(SUM(DM54:DM78)=0,0,SUM(DM54:DM78))","v":0},null,null,null,null,null,"Inicial",1,2,3,4,5,6,7,8,9,10,11,12,13,14,15,16,17,18,19,20,21,22,23,24,25,{"$f":"IF(EV53=\"\",0,$BC$115)","v":0},{"$f":"EZ53","v":"l/min"},{"$f":"IF(MAX(EU54:EU78)<>0,MAX(EU54:EU78),\"\")","v":""},{"$f":"IF(EU53=\"\",\"\",IF(AND(EW51=$AU$6,EW51<>\"\"),EV51,\"\"))","v":""},{"$f":"IF(EU53=\"\",\"\",MATCH(1,EU54:EU78,0))","v":""},"l/min",{"$f":"IF(FB53=\"\",0,$BC$84)","v":0},{"$f":"EX53","v":"l/min"},{"$f":"IF($FB$61<>\"\",$FB$61,IF($FB$62<>\"\",$FB$62,IF($FB$63<>\"\",$FB$63,IF($FB$64<>\"\",$FB$64,IF($FB$65<>\"\",$FB$65,IF($FB$66<>\"\",$FB$66,IF($FB$67<>\"\",$FB$67,\"\")))))))","v":""},{"$f":"IF(FB80<>\"\",FB80,IF($FA$52<>\"\",$FA$52,IF($FA$53<>\"\",$FA$53,IF($FB$52<>\"\",$FB$52,IF($FC$52<>\"\",$FC$52,\"\")))))","v":""},{"$f":"MAX(DN25:DN49)-COUNTBLANK(FB54:FB78)","v":0},"Acum.","l/min",null,null,null,null,null,"Caudal",null,null,null,"Caudal",null,null,null,"Caudal",null,null,null,"Caudal",null,null,null,"Caudal",null,null,null,"Caudal",null,null,null,"Caudal",null,null,null,"Caudal",null,null,null,"Caudal",null,null,null,"Caudal",null,null,null,"Caudal",null,null,null,"Caudal",null,null,null,"Caudal",null,null,null,"Caudal",null,null,null,"Caudal",null,null,null,"Caudal",null,null,null,"Caudal",null,null,null,"Caudal",null,null,null,"Caudal",null,null,null,"Caudal",null,null,null,"Caudal",null,null,null,"Caudal",null,null,null,"Caudal",null,null,null,"Caudal"]
[null,null,null,null,null,null,null,null,"","",{"$f":"IF(OR($EC113=\"\",$EC113=0),\"\",\"- Tubo de aço série M (\"&EB113&\")\")","v":""},null,null,null,null,"","","",null,null,null,null,null,null,null,null,null,null,null,null,null,null,null,null,null,null,null,null,null,null,null,null,null,null,null,{"$f":"IF($F25=\"\",\"\",IF($F25=$F$26,$AW$26,IF($F25=$F$27,$AW$27,IF($F25=$F$28,$AW$28,IF($F25=$F$29,$AW$29,IF($F25=$F$30,$AW$30,IF($F25=$F$31,$AW$31,\"\")))))))","v":""},{"$f":"IF($F25=\"\",\"\",IF($F25=$F$32,$AW$32,IF($F25=$F$33,$AW$33,IF($F25=$F$34,$AW$34,IF($F25=$F$35,$AW$35,IF($F25=$F$36,$AW$36,IF($F25=$F$37,$AW$37,\"\")))))))","v":""},{"$f":"IF($F25=\"\",\"\",IF($F25=$F$38,$AW$38,IF($F25=$F$39,$AW$39,IF($F25=$F$40,$AW$40,IF($F25=$F$41,$AW$41,IF($F25=$F$42,$AW$42,IF($F25=$F$43,$AW$43,IF($F25=$F$44,$AW$44,\"\"))))))))","v":""},{"$f":"IF($F25=\"\",\"\",IF($F25=$F$45,$AW$45,IF($F25=$F$46,$AW$46,IF($F25=$F$47,$AW$47,IF($F25=$F$48,$AW$48,IF($F25=$F$49,$AW$49,\"\"))))))","v":""},{"$f":"IF(AZ54=$FB$53,BH54,\"\")","v":0},{"$f":"IF(AND(AZ54=$EV$53,H25<>\"\"),H25,\"\")","v":""},{"$f":"IF(F25=\"\",\"\",F25)","v":""},{"$f":"IF(G25=\"\",\"\",G25)","v":""},{"$f":"IF(AY54=\"\",\"\",IF(AND(AY54<>\"\",AZ54=$EV$53),DN54,\"\"))","v":""},{"$f":"IF(OR($BB54=\"\",$DT54=\"\"),\"\",25-COUNTBLANK($DT54:$ER54))","v":""},{"$f":"IF(AX54=\"\",\"\",DN54)","v":1},null,{"$f":"IF(BG54=0,\"\",IF(AND(BB54=\"\",BG54=BH54+BI54),1,IF(AND($BB$79<>\"\",BB54=$BB$79),1,0)))","v":""},{"$f":"IF(BH54<=$AU$7,0,MIN(BJ54:CH54))","v":0},{"$f":"IF(H25=\"\",0,IF(OR(BB54=\"\",BB54=$BB$79),H25,0))","v":0},{"$f":"IF(DS25=\"\",0,DS25)","v":0},{"$f":"IF($BH54=$BH$54,$BH$54+$BI$54,\"\")","v":0},{"$f":"IF($BH54=$BH$55,$BH$55+$BI$55,\"\")","v":0},{"$f":"IF($BH54=$BH$56,$BH$56+$BI$56,\"\")","v":0},{"$f":"IF($BH54=$BH$57,$BH$57+$BI$57,\"\")","v":0},{"$f":"IF($BH54=$BH$58,$BH$58+$BI$58,\"\")","v":0},{"$f":"IF($BH54=$BH$59,$BH$59+$BI$59,\"\")","v":0},{"$f":"IF($BH54=$BH$60,$BH$60+$BI$60,\"\")","v":0},{"$f":"IF($BH54=$BH$61,$BH$61+$BI$61,\"\")","v":0},{"$f":"IF($BH54=$BH$62,$BH$62+$BI$62,\"\")","v":0},{"$f":"IF($BH54=$BH$63,$BH$63+$BI$63,\"\")","v":0},{"$f":"IF($BH54=$BH$64,$BH$64+$BI$64,\"\")","v":0},{"$f":"IF($BH54=$BH$65,$BH$65+$BI$65,\"\")","v":0},{"$f":"IF($BH54=$BH$66,$BH$66+$BI$66,\"\")","v":0},{"$f":"IF($BH54=$BH$67,$BH$67+$BI$67,\"\")","v":0},{"$f":"IF($BH54=$BH$68,$BH$68+$BI$68,\"\")","v":0},{"$f":"IF($BH54=$BH$69,$BH$69+$BI$69,\"\")","v":0},{"$f":"IF($BH54=$BH$70,$BH$70+$BI$70,\"\")","v":0},{"$f":"IF($BH54=$BH$71,$BH$71+$BI$71,\"\")","v":0},{"$f":"IF($BH54=$BH$72,$BH$72+$BI$72,\"\")","v":0},{"$f":"IF($BH54=$BH$73,$BH$73+$BI$73,\"\")","v":0},{"$f":"IF($BH54=$BH$74,$BH$74+$BI$74,\"\")","v":0},{"$f":"IF($BH54=$BH$75,$BH$75+$BI$75,\"\")","v":0},{"$f":"IF($BH54=$BH$76,$BH$76+$BI$76,\"\")","v":0},{"$f":"IF($BH54=$BH$77,$BH$77+$BI$77,\"\")","v":0},{"$f":"IF($BH54=$BH$78,$BH$78+$BI$78,\"\")","v":0},null,null,null,null,null,null,null,null,null,{"$f":"SUM(CR55:CR79)","v":0},null,"Lig.","Ordin.","Extra",null,null,null,null,null,null,null,null,null,null,null,null,null,{"$f":"IF(OR($AU$7=\"\",DO54=\"\"),\"\",IF(OR(H25=$AU$6,H25=$P$8),1,\"\"))","v":""},{"$f":"IF(OR($AU$7=\"\",DO54=\"\"),\"\",IF(H25<=$AU$7,1,\"\"))","v":""},{"$f":"IF(DM54=\"\",0,SUMIF($DS$54:$DS$78,DS54,$DM$54:$DM$78))","v":0},{"$f":"IF(OR(F25=\"\",G25=\"\",H25=0,H25=\"\"),\"\",1)","v":""},1,{"$f":"IF(OR(F25=\"\",G25=\"\"),\"\",1)","v":""},null,null,null,{"$f":"FF54","v":""},{"$f":"FG54","v":""},{"$f":"FI54","v":""},{"$f":"FM54","v":""},{"$f":"FQ54","v":""},{"$f":"FU54","v":""},{"$f":"FY54","v":""},{"$f":"GC54","v":""},{"$f":"GG54","v":""},{"$f":"GK54","v":""},{"$f":"GO54","v":""},{"$f":"GS54","v":""},{"$f":"GW54","v":""},{"$f":"HA54","v":""},{"$f":"HE54","v":""},{"$f":"HI54","v":""},{"$f":"HM54","v":""},{"$f":"HQ54","v":""},{"$f":"HU54","v":""},{"$f":"HY54","v":""},{"$f":"IC54","v":""},{"$f":"IG54","v":""},{"$f":"IK54","v":""},{"$f":"IO54","v":""},{"$f":"IS54","v":""},{"$f":"IW54","v":""},{"$f":"IF(OR(D25=\"s\",H25<=$AU$7),0,IF(AND($EV$53<>\"\",D25<>\"s\",H25>=$AU$6,B25=\"c\"),ET54*$ES$53,IF(AND(Q25<>\"\",$EV$53<>\"\",D25<>\"s\",H25>=$AU$7,B25=\"nc\"),$ES$53-Q25,0)))","v":0},{"$f":"COUNTIF(DS54:ER54,$EV$53)","v":26},{"$f":"IF(OR(EV54=\"\",$EW$52=0),\"\",IF(EW54=$EW$52,1,\"\"))","v":""},{"$f":"IF(EW54=\"\",\"\",IF(AND(OR(EW54>=$AU$7,EW54=$AU$6),COUNTIF($DS$54:$DS$78,DS54)>1,DT54<>\"\"),DS54,\"\"))","v":""},{"$f":"IF(OR(DM54=\"\",DL54<2),\"\",IF(AND(OR(H25>=$AU$7,H25>=$AU$6),COUNTIF($DS$54:$DS$78,DS54)>1),H25,\"\"))","v":""},{"$f":"IF(OR(FF54=\"\",FG54=\"\"),\"\",IF(H25>=1,EY54+ES54+FD54,\"\"))","v":""},{"$f":"EZ54*$EY$53","v":0},{"$f":"COUNTIF(DT54:ER54,$FB$53)","v":25},{"$f":"IF(DS54=\"\",\"\",COUNTIF($DS$54:$DS$78,DS54))","v":""},{"$f":"IF(AND(FA54>1,DP25>=1,H25>0,DT54<>\"\"),DS54,\"\")","v":""},{"$f":"IF($FB54=\"\",\"\",INDEX($H$25:$H$49,$DN25))","v":""},{"$f":"IF(OR(FF54=\"\",FG54=\"\"),\"\",IF(AND(Q25<>\"\",$EV$53<>\"\",D25<>\"s\",H25>=$AU$7,B25=\"nc\"),Q25,FE54+FK54+FO54+FS54+FW54+GA54+GE54+GI54+GM54+GQ54+GU54+GY54+HC54+HG54+HK54+HO54+HS54+HW54+IA54+IE54+II54+IM54+IQ54+IU54+IY54))","v":""},{"$f":"IF(OR($Q25=\"\",FG54=\"\"),0,$Q25)","v":0},{"$f":"IF(FF25=0,\"\",FF25)","v":""},{"$f":"IF(FG25=0,\"\",FG25)","v":""},{"$f":"IF(OR(FG54=0,COUNTIF($FF$54:$FF$78,FG54)=0),\"\",IF(FG54=$EV$53,$BA$23,MATCH(FG54,$FF$54:$FF$78,0)))","v":""},{"$f":"IF(FH54=\"\",\"\",LOOKUP(FH54,$DN$25:$DN$49,$FG$54:$FG$78))","v":""},{"$f":"IF(OR(FI54=0,COUNTIF($FG$54:$FG$78,FI54)=0),\"\",MATCH(FI54,$FG$54:$FG$78,0))","v":1},{"$f":"IF(FJ54=\"\",0,LOOKUP(FJ54,$DN$25:$DN$49,$FE$54:$FE$78))","v":0},{"$f":"IF(OR(FI54=0,COUNTIF($FF$54:$FF$78,FI54)=0),\"\",IF(FI54=$EV$53,$BA$23,MATCH(FI54,$FF$54:$FF$78,0)))","v":""},{"$f":"IF(FL54=\"\",\"\",LOOKUP(FL54,$DN$25:$DN$49,$FG$54:$FG$78))","v":""},{"$f":"IF(OR(FM54=0,COUNTIF($FG$54:$FG$78,FM54)=0),\"\",MATCH(FM54,$FG$54:$FG$78,0))","v":1},{"$f":"IF(FN54=\"\",0,LOOKUP(FN54,$DN$25:$DN$49,$FE$54:$FE$78))","v":0},{"$f":"IF(OR(FM54=0,COUNTIF($FF$54:$FF$78,FM54)=0),\"\",IF(FM54=$EV$53,$BA$23,MATCH(FM54,$FF$54:$FF$78,0)))","v":""},{"$f":"IF(FP54=\"\",\"\",LOOKUP(FP54,$DN$25:$DN$49,$FG$54:$FG$78))","v":""},{"$f":"IF(OR(FQ54=0,COUNTIF($FG$54:$FG$78,FQ54)=0),\"\",MATCH(FQ54,$FG$54:$FG$78,0))","v":1},{"$f":"IF(FR54=\"\",0,LOOKUP(FR54,$DN$25:$DN$49,$FE$54:$FE$78))","v":0},{"$f":"IF(OR(FQ54=0,COUNTIF($FF$54:$FF$78,FQ54)=0),\"\",IF(FQ54=$EV$53,$BA$23,MATCH(FQ54,$FF$54:$FF$78,0)))","v":""},{"$f":"IF(FT54=\"\",\"\",LOOKUP(FT54,$DN$25:$DN$49,$FG$54:$FG$78))","v":""},{"$f":"IF(OR(FU54=0,COUNTIF($FG$54:$FG$78,FU54)=0),\"\",MATCH(FU54,$FG$54:$FG$78,0))","v":1},{"$f":"IF(FV54=\"\",0,LOOKUP(FV54,$DN$25:$DN$49,$FE$54:$FE$78))","v":0},{"$f":"IF(OR(FU54=0,COUNTIF($FF$54:$FF$78,FU54)=0),\"\",IF(FU54=$EV$53,$BA$23,MATCH(FU54,$FF$54:$FF$78,0)))","v":""},{"$f":"IF(FX54=\"\",\"\",LOOKUP(FX54,$DN$25:$DN$49,$FG$54:$FG$78))","v":""},{"$f":"IF(OR(FY54=0,COUNTIF($FG$54:$FG$78,FY54)=0),\"\",MATCH(FY54,$FG$54:$FG$78,0))","v":1},{"$f":"IF(FZ54=\"\",0,LOOKUP(FZ54,$DN$25:$DN$49,$FE$54:$FE$78))","v":0},{"$f":"IF(OR(FY54=0,COUNTIF($FF$54:$FF$78,FY54)=0),\"\",IF(FY54=$EV$53,$BA$23,MATCH(FY54,$FF$54:$FF$78,0)))","v":""},{"$f":"IF(GB54=\"\",\"\",LOOKUP(GB54,$DN$25:$DN$49,$FG$54:$FG$78))","v":""},{"$f":"IF(OR(GC54=0,COUNTIF($FG$54:$FG$78,GC54)=0),\"\",MATCH(GC54,$FG$54:$FG$78,0))","v":1},{"$f":"IF(GD54=\"\",0,LOOKUP(GD54,$DN$25:$DN$49,$FE$54:$FE$78))","v":0},{"$f":"IF(OR(GC54=0,COUNTIF($FF$54:$FF$78,GC54)=0),\"\",IF(GC54=$EV$53,$BA$23,MATCH(GC54,$FF$54:$FF$78,0)))","v":""},{"$f":"IF(GF54=\"\",\"\",LOOKUP(GF54,$DN$25:$DN$49,$FG$54:$FG$78))","v":""},{"$f":"IF(OR(GG54=0,COUNTIF($FG$54:$FG$78,GG54)=0),\"\",MATCH(GG54,$FG$54:$FG$78,0))","v":1},{"$f":"IF(GH54=\"\",0,LOOKUP(GH54,$DN$25:$DN$49,$FE$54:$FE$78))","v":0},{"$f":"IF(OR(GG54=0,COUNTIF($FF$54:$FF$78,GG54)=0),\"\",IF(GG54=$EV$53,$BA$23,MATCH(GG54,$FF$54:$FF$78,0)))","v":""},{"$f":"IF(GJ54=\"\",\"\",LOOKUP(GJ54,$DN$25:$DN$49,$FG$54:$FG$78))","v":""},{"$f":"IF(OR(GK54=0,COUNTIF($FG$54:$FG$78,GK54)=0),\"\",MATCH(GK54,$FG$54:$FG$78,0))","v":1},{"$f":"IF(GL54=\"\",0,LOOKUP(GL54,$DN$25:$DN$49,$FE$54:$FE$78))","v":0},{"$f":"IF(OR(GK54=0,COUNTIF($FF$54:$FF$78,GK54)=0),\"\",IF(GK54=$EV$53,$BA$23,MATCH(GK54,$FF$54:$FF$78,0)))","v":""},{"$f":"IF(GN54=\"\",\"\",LOOKUP(GN54,$DN$25:$DN$49,$FG$54:$FG$78))","v":""},{"$f":"IF(OR(GO54=0,COUNTIF($FG$54:$FG$78,GO54)=0),\"\",MATCH(GO54,$FG$54:$FG$78,0))","v":1},{"$f":"IF(GP54=\"\",0,LOOKUP(GP54,$DN$25:$DN$49,$FE$54:$FE$78))","v":0},{"$f":"IF(OR(GO54=0,COUNTIF($FF$54:$FF$78,GO54)=0),\"\",IF(GO54=$EV$53,$BA$23,MATCH(GO54,$FF$54:$FF$78,0)))","v":""},{"$f":"IF(GR54=\"\",\"\",LOOKUP(GR54,$DN$25:$DN$49,$FG$54:$FG$78))","v":""},{"$f":"IF(OR(GS54=0,COUNTIF($FG$54:$FG$78,GS54)=0),\"\",MATCH(GS54,$FG$54:$FG$78,0))","v":1},{"$f":"IF(GT54=\"\",0,LOOKUP(GT54,$DN$25:$DN$49,$FE$54:$FE$78))","v":0},{"$f":"IF(OR(GS54=0,COUNTIF($FF$54:$FF$78,GS54)=0),\"\",IF(GS54=$EV$53,$BA$23,MATCH(GS54,$FF$54:$FF$78,0)))","v":""},{"$f":"IF(GV54=\"\",\"\",LOOKUP(GV54,$DN$25:$DN$49,$FG$54:$FG$78))","v":""},{"$f":"IF(OR(GW54=0,COUNTIF($FG$54:$FG$78,GW54)=0),\"\",MATCH(GW54,$FG$54:$FG$78,0))","v":1},{"$f":"IF(GX54=\"\",0,LOOKUP(GX54,$DN$25:$DN$49,$FE$54:$FE$78))","v":0},{"$f":"IF(OR(GW54=0,COUNTIF($FF$54:$FF$78,GW54)=0),\"\",IF(GW54=$EV$53,$BA$23,MATCH(GW54,$FF$54:$FF$78,0)))","v":""},{"$f":"IF(GZ54=\"\",\"\",LOOKUP(GZ54,$DN$25:$DN$49,$FG$54:$FG$78))","v":""},{"$f":"IF(OR(HA54=0,COUNTIF($FG$54:$FG$78,HA54)=0),\"\",MATCH(HA54,$FG$54:$FG$78,0))","v":1},{"$f":"IF(HB54=\"\",0,LOOKUP(HB54,$DN$25:$DN$49,$FE$54:$FE$78))","v":0},{"$f":"IF(OR(HA54=0,COUNTIF($FF$54:$FF$78,HA54)=0),\"\",IF(HA54=$EV$53,$BA$23,MATCH(HA54,$FF$54:$FF$78,0)))","v":""},{"$f":"IF(HD54=\"\",\"\",LOOKUP(HD54,$DN$25:$DN$49,$FG$54:$FG$78))","v":""},{"$f":"IF(OR(HE54=0,COUNTIF($FG$54:$FG$78,HE54)=0),\"\",MATCH(HE54,$FG$54:$FG$78,0))","v":1},{"$f":"IF(HF54=\"\",0,LOOKUP(HF54,$DN$25:$DN$49,$FE$54:$FE$78))","v":0},{"$f":"IF(OR(HE54=0,COUNTIF($FF$54:$FF$78,HE54)=0),\"\",IF(HE54=$EV$53,$BA$23,MATCH(HE54,$FF$54:$FF$78,0)))","v":""},{"$f":"IF(HH54=\"\",\"\",LOOKUP(HH54,$DN$25:$DN$49,$FG$54:$FG$78))","v":""},{"$f":"IF(OR(HI54=0,COUNTIF($FG$54:$FG$78,HI54)=0),\"\",MATCH(HI54,$FG$54:$FG$78,0))","v":1},{"$f":"IF(HJ54=\"\",0,LOOKUP(HJ54,$DN$25:$DN$49,$FE$54:$FE$78))","v":0},{"$f":"IF(OR(HI54=0,COUNTIF($FF$54:$FF$78,HI54)=0),\"\",IF(HI54=$EV$53,$BA$23,MATCH(HI54,$FF$54:$FF$78,0)))","v":""},{"$f":"IF(HL54=\"\",\"\",LOOKUP(HL54,$DN$25:$DN$49,$FG$54:$FG$78))","v":""},{"$f":"IF(OR(HM54=0,COUNTIF($FG$54:$FG$78,HM54)=0),\"\",MATCH(HM54,$FG$54:$FG$78,0))","v":1},{"$f":"IF(HN54=\"\",0,LOOKUP(HN54,$DN$25:$DN$49,$FE$54:$FE$78))","v":0},{"$f":"IF(OR(HM54=0,COUNTIF($FF$54:$FF$78,HM54)=0),\"\",IF(HM54=$EV$53,$BA$23,MATCH(HM54,$FF$54:$FF$78,0)))","v":""},{"$f":"IF(HP54=\"\",\"\",LOOKUP(HP54,$DN$25:$DN$49,$FG$54:$FG$78))","v":""},{"$f":"IF(OR(HQ54=0,COUNTIF($FG$54:$FG$78,HQ54)=0),\"\",MATCH(HQ54,$FG$54:$FG$78,0))","v":1},{"$f":"IF(HR54=\"\",0,LOOKUP(HR54,$DN$25:$DN$49,$FE$54:$FE$78))","v":0},{"$f":"IF(OR(HQ54=0,COUNTIF($FF$54:$FF$78,HQ54)=0),\"\",IF(HQ54=$EV$53,$BA$23,MATCH(HQ54,$FF$54:$FF$78,0)))","v":""},{"$f":"IF(HT54=\"\",\"\",LOOKUP(HT54,$DN$25:$DN$49,$FG$54:$FG$78))","v":""},{"$f":"IF(OR(HU54=0,COUNTIF($FG$54:$FG$78,HU54)=0),\"\",MATCH(HU54,$FG$54:$FG$78,0))","v":1},{"$f":"IF(HV54=\"\",0,LOOKUP(HV54,$DN$25:$DN$49,$FE$54:$FE$78))","v":0},{"$f":"IF(OR(HU54=0,COUNTIF($FF$54:$FF$78,HU54)=0),\"\",IF(HU54=$EV$53,$BA$23,MATCH(HU54,$FF$54:$FF$78,0)))","v":""},{"$f":"IF(HX54=\"\",\"\",LOOKUP(HX54,$DN$25:$DN$49,$FG$54:$FG$78))","v":""},{"$f":"IF(OR(HY54=0,COUNTIF($FG$54:$FG$78,HY54)=0),\"\",MATCH(HY54,$FG$54:$FG$78,0))","v":1},{"$f":"IF(HZ54=\"\",0,LOOKUP(HZ54,$DN$25:$DN$49,$FE$54:$FE$78))","v":0},{"$f":"IF(OR(HY54=0,COUNTIF($FF$54:$FF$78,HY54)=0),\"\",IF(HY54=$EV$53,$BA$23,MATCH(HY54,$FF$54:$FF$78,0)))","v":""},{"$f":"IF(IB54=\"\",\"\",LOOKUP(IB54,$DN$25:$DN$49,$FG$54:$FG$78))","v":""},{"$f":"IF(OR(IC54=0,COUNTIF($FG$54:$FG$78,IC54)=0),\"\",MATCH(IC54,$FG$54:$FG$78,0))","v":1},{"$f":"IF(ID54=\"\",0,LOOKUP(ID54,$DN$25:$DN$49,$FE$54:$FE$78))","v":0},{"$f":"IF(OR(IC54=0,COUNTIF($FF$54:$FF$78,IC54)=0),\"\",IF(IC54=$EV$53,$BA$23,MATCH(IC54,$FF$54:$FF$78,0)))","v":""},{"$f":"IF(IF54=\"\",\"\",LOOKUP(IF54,$DN$25:$DN$49,$FG$54:$FG$78))","v":""},{"$f":"IF(OR(IG54=0,COUNTIF($FG$54:$FG$78,IG54)=0),\"\",MATCH(IG54,$FG$54:$FG$78,0))","v":1},{"$f":"IF(IH54=\"\",0,LOOKUP(IH54,$DN$25:$DN$49,$FE$54:$FE$78))","v":0},{"$f":"IF(OR(IG54=0,COUNTIF($FF$54:$FF$78,IG54)=0),\"\",IF(IG54=$EV$53,$BA$23,MATCH(IG54,$FF$54:$FF$78,0)))","v":""},{"$f":"IF(IJ54=\"\",\"\",LOOKUP(IJ54,$DN$25:$DN$49,$FG$54:$FG$78))","v":""},{"$f":"IF(OR(IK54=0,COUNTIF($FG$54:$FG$78,IK54)=0),\"\",MATCH(IK54,$FG$54:$FG$78,0))","v":1},{"$f":"IF(IL54=\"\",0,LOOKUP(IL54,$DN$25:$DN$49,$FE$54:$FE$78))","v":0},{"$f":"IF(OR(IK54=0,COUNTIF($FF$54:$FF$78,IK54)=0),\"\",IF(IK54=$EV$53,$BA$23,MATCH(IK54,$FF$54:$FF$78,0)))","v":""},{"$f":"IF(IN54=\"\",\"\",LOOKUP(IN54,$DN$25:$DN$49,$FG$54:$FG$78))","v":""},{"$f":"IF(OR(IO54=0,COUNTIF($FG$54:$FG$78,IO54)=0),\"\",MATCH(IO54,$FG$54:$FG$78,0))","v":1},{"$f":"IF(IP54=\"\",0,LOOKUP(IP54,$DN$25:$DN$49,$FE$54:$FE$78))","v":0},{"$f":"IF(OR(IO54=0,COUNTIF($FF$54:$FF$78,IO54)=0),\"\",IF(IO54=$EV$53,$BA$23,MATCH(IO54,$FF$54:$FF$78,0)))","v":""},{"$f":"IF(IR54=\"\",\"\",LOOKUP(IR54,$DN$25:$DN$49,$FG$54:$FG$78))","v":""},{"$f":"IF(OR(IS54=0,COUNTIF($FG$54:$FG$78,IS54)=0),\"\",MATCH(IS54,$FG$54:$FG$78,0))","v":1},{"$f":"IF(IT54=\"\",0,LOOKUP(IT54,$DN$25:$DN$49,$FE$54:$FE$78))","v":0},{"$f":"IF(OR(IS54=0,COUNTIF($FF$54:$FF$78,IS54)=0),\"\",IF(IS54=$EV$53,$BA$23,MATCH(IS54,$FF$54:$FF$78,0)))","v":""},{"$f":"IF(IV54=\"\",\"\",LOOKUP(IV54,$DN$25:$DN$49,$FG$54:$FG$78))","v":""},{"$f":"IF(OR(IW54=0,COUNTIF($FG$54:$FG$78,IW54)=0),\"\",MATCH(IW54,$FG$54:$FG$78,0))","v":1},{"$f":"IF(IX54=\"\",0,LOOKUP(IX54,$DN$25:$DN$49,$FE$54:$FE$78))","v":0}]
[null,null,null,null,null,null,null,null,"","","",null,null,null,null,"","","",null,null,null,null,null,null,null,null,null,null,null,null,null,null,null,null,null,null,null,null,null,null,null,null,null,null,null,{"$f":"IF($F26=\"\",\"\",IF($F26=$F$25,$AW$25,IF($F26=$F$27,$AW$27,IF($F26=$F$28,$AW$28,IF($F26=$F$29,$AW$29,IF($F26=$F$30,$AW$30,IF($F26=$F$31,$AW$31,\"\")))))))","v":""},"","","",0,"","","","","",{"$f":"IF(AX55=\"\",\"\",DN55)","v":2},null,"",0,0,0,{"$f":"IF($BH55=$BH$54,$BH$54+$BI$54,\"\")","v":0},0,0,0,0,0,0,0,0,0,{"$f":"IF($BH55=$BH$64,$BH$64+$BI$64,\"\")","v":0},{"$f":"IF($BH55=$BH$65,$BH$65+$BI$65,\"\")","v":0},{"$f":"IF($BH55=$BH$66,$BH$66+$BI$66,\"\")","v":0},{"$f":"IF($BH55=$BH$67,$BH$67+$BI$67,\"\")","v":0},{"$f":"IF($BH55=$BH$68,$BH$68+$BI$68,\"\")","v":0},{"$f":"IF($BH55=$BH$69,$BH$69+$BI$69,\"\")","v":0},{"$f":"IF($BH55=$BH$70,$BH$70+$BI$70,\"\")","v":0},{"$f":"IF($BH55=$BH$71,$BH$71+$BI$71,\"\")","v":0},{"$f":"IF($BH55=$BH$72,$BH$72+$BI$72,\"\")","v":0},{"$f":"IF($BH55=$BH$73,$BH$73+$BI$73,\"\")","v":0},{"$f":"IF($BH55=$BH$74,$BH$74+$BI$74,\"\")","v":0},{"$f":"IF($BH55=$BH$75,$BH$75+$BI$75,\"\")","v":0},{"$f":"IF($BH55=$BH$76,$BH$76+$BI$76,\"\")","v":0},{"$f":"IF($BH55=$BH$77,$BH$77+$BI$77,\"\")","v":0},{"$f":"IF($BH55=$BH$78,$BH$78+$BI$78,\"\")","v":0},null,null,null,null,null,null,null,null,null,{"$f":"IF(OR(AJ25=\"\",AJ25=\"Conforme\",AJ25=\"Não aplicável\"),0,1)","v":0},null,{"$f":"IF(OR($A$5<>11,$E25=\"\"),\"\",IF($CS25<=3,27.3,IF($CS25<=4,36,IF($CS25<=5,41.9,IF($CS25<=10,53.1,IF($CS25<=30,68.9,IF($CS25<=60,80.9,IF($CS25<=100,105.3,129.7))))))))","v":""},{"$f":"IF(OR(AND($A$5<>12,$A$5<>13,$A$5<>14,$A$5<>15),$E25=\"\"),\"\",IF($CS25<=2,27.3,IF($CS25<=3,36,IF($CS25<=4,41.9,IF($CS25<=9,53.1,IF($CS25<=18,68.9,IF($CS25<=40,80.9,IF($CS25<=100,105.3,129.7))))))))","v":""},{"$f":"IF(OR(AND($A$5<>16,$A$5<>17,$A$5<>18),$E25=\"\"),\"\",IF($CS25<=1,27.3,IF($CS25<=2,36,IF($CS25<=4,41.9,IF($CS25<=8,53.1,IF($CS25<=12,68.9,IF($CS25<=18,80.9,IF($CS25<=48,105.3,129.7))))))))","v":""},null,null,null,null,null,null,null,null,null,null,null,null,null,{"$f":"IF(OR($AU$7=\"\",DO55=\"\"),\"\",IF(OR(H26=$AU$6,H26=$P$8),1,\"\"))","v":""},{"$f":"IF(OR($AU$7=\"\",DO55=\"\"),\"\",IF(H26<=$AU$7,1,\"\"))","v":""},{"$f":"IF(DM55=\"\",0,SUMIF($DS$54:$DS$78,DS55,$DM$54:$DM$78))","v":0},"",2,"",null,null,null,"","","","","","","","","","","","","","","","","","","","","","","","","","",0,{"$f":"COUNTIF(DS55:ER55,$EV$53)","v":26},{"$f":"IF(OR(EV55=\"\",$EW$52=0),\"\",IF(EW55=$EW$52,1,\"\"))","v":""},"","","",0,{"$f":"COUNTIF(DT55:ER55,$FB$53)","v":25},{"$f":"IF(DS55=\"\",\"\",COUNTIF($DS$54:$DS$78,DS55))","v":""},"",{"$f":"IF($FB55=\"\",\"\",INDEX($H$25:$H$49,$DN26))","v":""},{"$f":"IF(OR(FF55=\"\",FG55=\"\"),\"\",IF(AND(Q26<>\"\",$EV$53<>\"\",D26<>\"s\",H26>=$AU$7,B26=\"nc\"),Q26,FE55+FK55+FO55+FS55+FW55+GA55+GE55+GI55+GM55+GQ55+GU55+GY55+HC55+HG55+HK55+HO55+HS55+HW55+IA55+IE55+II55+IM55+IQ55+IU55+IY55))","v":""},0,{"$f":"IF(FF26=0,\"\",FF26)","v":""},"",{"$f":"IF(OR(FG55=0,COUNTIF($FF$54:$FF$78,FG55)=0),\"\",IF(FG55=$EV$53,$BA$23,MATCH(FG55,$FF$54:$FF$78,0)))","v":""},"",1,{"$f":"IF(FJ55=\"\",0,LOOKUP(FJ55,$DN$25:$DN$49,$FE$54:$FE$78))","v":0},{"$f":"IF(OR(FI55=0,COUNTIF($FF$54:$FF$78,FI55)=0),\"\",IF(FI55=$EV$53,$BA$23,MATCH(FI55,$FF$54:$FF$78,0)))","v":""},"",1,0,{"$f":"IF(OR(FM55=0,COUNTIF($FF$54:$FF$78,FM55)=0),\"\",IF(FM55=$EV$53,$BA$23,MATCH(FM55,$FF$54:$FF$78,0)))","v":""},"",{"$f":"IF(OR(FQ55=0,COUNTIF($FG$54:$FG$78,FQ55)=0),\"\",MATCH(FQ55,$FG$54:$FG$78,0))","v":1},0,{"$f":"IF(OR(FQ55=0,COUNTIF($FF$54:$FF$78,FQ55)=0),\"\",IF(FQ55=$EV$53,$BA$23,MATCH(FQ55,$FF$54:$FF$78,0)))","v":""},"",{"$f":"IF(OR(FU55=0,COUNTIF($FG$54:$FG$78,FU55)=0),\"\",MATCH(FU55,$FG$54:$FG$78,0))","v":1},0,{"$f":"IF(OR(FU55=0,COUNTIF($FF$54:$FF$78,FU55)=0),\"\",IF(FU55=$EV$53,$BA$23,MATCH(FU55,$FF$54:$FF$78,0)))","v":""},"",{"$f":"IF(OR(FY55=0,COUNTIF($FG$54:$FG$78,FY55)=0),\"\",MATCH(FY55,$FG$54:$FG$78,0))","v":1},0,{"$f":"IF(OR(FY55=0,COUNTIF($FF$54:$FF$78,FY55)=0),\"\",IF(FY55=$EV$53,$BA$23,MATCH(FY55,$FF$54:$FF$78,0)))","v":""},"",{"$f":"IF(OR(GC55=0,COUNTIF($FG$54:$FG$78,GC55)=0),\"\",MATCH(GC55,$FG$54:$FG$78,0))","v":1},0,{"$f":"IF(OR(GC55=0,COUNTIF($FF$54:$FF$78,GC55)=0),\"\",IF(GC55=$EV$53,$BA$23,MATCH(GC55,$FF$54:$FF$78,0)))","v":""},"",1,0,{"$f":"IF(OR(GG55=0,COUNTIF($FF$54:$FF$78,GG55)=0),\"\",IF(GG55=$EV$53,$BA$23,MATCH(GG55,$FF$54:$FF$78,0)))","v":""},"",1,0,{"$f":"IF(OR(GK55=0,COUNTIF($FF$54:$FF$78,GK55)=0),\"\",IF(GK55=$EV$53,$BA$23,MATCH(GK55,$FF$54:$FF$78,0)))","v":""},"",1,0,{"$f":"IF(OR(GO55=0,COUNTIF($FF$54:$FF$78,GO55)=0),\"\",IF(GO55=$EV$53,$BA$23,MATCH(GO55,$FF$54:$FF$78,0)))","v":""},"",1,0,{"$f":"IF(OR(GS55=0,COUNTIF($FF$54:$FF$78,GS55)=0),\"\",IF(GS55=$EV$53,$BA$23,MATCH(GS55,$FF$54:$FF$78,0)))","v":""},"",1,0,{"$f":"IF(OR(GW55=0,COUNTIF($FF$54:$FF$78,GW55)=0),\"\",IF(GW55=$EV$53,$BA$23,MATCH(GW55,$FF$54:$FF$78,0)))","v":""},"",1,0,{"$f":"IF(OR(HA55=0,COUNTIF($FF$54:$FF$78,HA55)=0),\"\",IF(HA55=$EV$53,$BA$23,MATCH(HA55,$FF$54:$FF$78,0)))","v":""},"",1,0,{"$f":"IF(OR(HE55=0,COUNTIF($FF$54:$FF$78,HE55)=0),\"\",IF(HE55=$EV$53,$BA$23,MATCH(HE55,$FF$54:$FF$78,0)))","v":""},"",1,0,{"$f":"IF(OR(HI55=0,COUNTIF($FF$54:$FF$78,HI55)=0),\"\",IF(HI55=$EV$53,$BA$23,MATCH(HI55,$FF$54:$FF$78,0)))","v":""},"",1,0,{"$f":"IF(OR(HM55=0,COUNTIF($FF$54:$FF$78,HM55)=0),\"\",IF(HM55=$EV$53,$BA$23,MATCH(HM55,$FF$54:$FF$78,0)))","v":""},"",1,0,{"$f":"IF(OR(HQ55=0,COUNTIF($FF$54:$FF$78,HQ55)=0),\"\",IF(HQ55=$EV$53,$BA$23,MATCH(HQ55,$FF$54:$FF$78,0)))","v":""},"",1,0,{"$f":"IF(OR(HU55=0,COUNTIF($FF$54:$FF$78,HU55)=0),\"\",IF(HU55=$EV$53,$BA$23,MATCH(HU55,$FF$54:$FF$78,0)))","v":""},"",1,0,{"$f":"IF(OR(HY55=0,COUNTIF($FF$54:$FF$78,HY55)=0),\"\",IF(HY55=$EV$53,$BA$23,MATCH(HY55,$FF$54:$FF$78,0)))","v":""},"",1,0,{"$f":"IF(OR(IC55=0,COUNTIF($FF$54:$FF$78,IC55)=0),\"\",IF(IC55=$EV$53,$BA$23,MATCH(IC55,$FF$54:$FF$78,0)))","v":""},"",1,0,{"$f":"IF(OR(IG55=0,COUNTIF($FF$54:$FF$78,IG55)=0),\"\",IF(IG55=$EV$53,$BA$23,MATCH(IG55,$FF$54:$FF$78,0)))","v":""},"",1,0,{"$f":"IF(OR(IK55=0,COUNTIF($FF$54:$FF$78,IK55)=0),\"\",IF(IK55=$EV$53,$BA$23,MATCH(IK55,$FF$54:$FF$78,0)))","v":""},"",1,0,{"$f":"IF(OR(IO55=0,COUNTIF($FF$54:$FF$78,IO55)=0),\"\",IF(IO55=$EV$53,$BA$23,MATCH(IO55,$FF$54:$FF$78,0)))","v":""},"",1,0,{"$f":"IF(OR(IS55=0,COUNTIF($FF$54:$FF$78,IS55)=0),\"\",IF(IS55=$EV$53,$BA$23,MATCH(IS55,$FF$54:$FF$78,0)))","v":""},"",1,0]
[null,null,null,null,null,null,null,null,"","","",null,null,null,null,"","","",null,null,null,null,null,null,null,null,null,null,null,null,null,null,null,null,null,null,null,null,null,null,null,null,null,null,null,{"$f":"IF($F27=\"\",\"\",IF($F27=$F$25,$AW$25,IF($F27=$F$26,$AW$26,IF($F27=$F$28,$AW$28,IF($F27=$F$29,$AW$29,IF($F27=$F$30,$AW$30,IF($F27=$F$31,$AW$31,\"\")))))))","v":""},"","","",0,"","","","","",3,null,"",0,0,0,0,0,0,0,0,0,0,0,0,0,0,0,0,0,0,0,0,0,0,0,0,0,0,0,0,null,null,null,null,null,null,null,null,null,0,null,"","","",null,null,null,null,null,null,null,null,null,null,null,null,null,"","",0,"",3,"",null,null,null,"","","","","","","","","","","","","","","","","","","","","","","","","","",0,26,"","","","",0,25,"","",{"$f":"IF($FB56=\"\",\"\",INDEX($H$25:$H$49,$DN27))","v":""},"",0,"","",{"$f":"IF(OR(FG56=0,COUNTIF($FF$54:$FF$78,FG56)=0),\"\",IF(FG56=$EV$53,$BA$23,MATCH(FG56,$FF$54:$FF$78,0)))","v":""},"",1,0,"","",1,0,"","",1,0,"","",1,0,"","",1,0,"","",1,0,"","",1,0,"","",1,0,"","",1,0,"","",1,0,"","",1,0,"","",1,0,"","",1,0,"","",1,0,"","",1,0,"","",1,0,"","",1,0,"","",1,0,"","",1,0,"","",1,0,"","",1,0,"","",1,0,"","",1,0,"","",1,0]
[null,null,null,null,null,null,null,null,"","","",null,null,null,null,"","","",null,null,null,null,null,null,null,null,null,null,null,null,null,null,null,null,null,null,null,null,"Folha de Cálculo de distribuição gratuíta. Para efeitos legais, declinamos qualquer responsabilidade sobre os resultados obtidos.",null,null,null,null,null,null,{"$f":"IF($F28=\"\",\"\",IF($F28=$F$25,$AW$25,IF($F28=$F$26,$AW$26,IF($F28=$F$27,$AW$27,IF($F28=$F$29,$AW$29,IF($F28=$F$30,$AW$30,IF($F28=$F$31,$AW$31,\"\")))))))","v":""},"","","",0,"","","","","",4,null,"",0,0,0,0,0,0,0,0,0,0,0,0,0,0,0,0,0,0,0,0,0,0,0,0,0,0,0,0,null,null,null,null,null,null,null,null,null,0,null,"","","",null,null,null,null,null,null,null,null,null,null,null,null,null,"","",0,"",4,"",null,null,null,"","","","","","","","","","","","","","","","","","","","","","","","","","",0,26,"","","","",0,25,"","",{"$f":"IF($FB57=\"\",\"\",INDEX($H$25:$H$49,$DN28))","v":""},"",0,"","","","",1,0,"","",1,0,"","",1,0,"","",1,0,"","",1,0,"","",1,0,"","",1,0,"","",1,0,"","",1,0,"","",1,0,"","",1,0,"","",1,0,"","",1,0,"","",1,0,"","",1,0,"","",1,0,"","",1,0,"","",1,0,"","",1,0,"","",1,0,"","",1,0,"","",1,0,"","",1,0,"","",1,0]
[null,null,null,null,null,null,null,null,null,null,null,null,null,null,null,null,null,null,null,null,null,null,null,null,null,null,null,null,null,null,null,null,null,null,null,null,null,null,null,null,null,null,null,null,null,{"$f":"IF($F29=\"\",\"\",IF($F29=$F$25,$AW$25,IF($F29=$F$26,$AW$26,IF($F29=$F$27,$AW$27,IF($F29=$F$28,$AW$28,IF($F29=$F$30,$AW$30,IF($F29=$F$31,$AW$31,\"\")))))))","v":""},"","","",0,"","","","","",5,null,"",0,0,0,0,0,0,0,0,0,0,0,0,0,0,0,0,0,0,0,0,0,0,0,0,0,0,0,0,null,null,null,null,null,null,null,null,null,0,null,"","","",null,null,null,null,null,null,null,null,null,null,null,null,null,"","",0,"",5,"",null,null,null,"","","","","","","","","","","","","","","","","","","","","","","","","","",0,26,"","","","",0,25,"","",{"$f":"IF($FB58=\"\",\"\",INDEX($H$25:$H$49,$DN29))","v":""},"",0,"","","","",1,0,"","",1,0,"","",1,0,"","",1,0,"","",1,0,"","",1,0,"","",1,0,"","",1,0,"","",1,0,"","",1,0,"","",1,0,"","",1,0,"","",1,0,"","",1,0,"","",1,0,"","",1,0,"","",1,0,"","",1,0,"","",1,0,"","",1,0,"","",1,0,"","",1,0,"","",1,0,"","",1,0]
[null,null,null,null,null,null,null,null,null,null,null,null,null,null,null,null,null,null,null,null,null,null,null,null,null,null,null,null,null,null,null,null,null,null,null,null,null,null,null,null,null,null,null,null,null,{"$f":"IF($F30=\"\",\"\",IF($F30=$F$25,$AW$25,IF($F30=$F$26,$AW$26,IF($F30=$F$27,$AW$27,IF($F30=$F$28,$AW$28,IF($F30=$F$29,$AW$29,IF($F30=$F$31,$AW$31,\"\")))))))","v":""},"","","",0,"","","","","",6,null,"",0,0,0,0,0,0,0,0,0,0,0,0,0,0,0,0,0,0,0,0,0,0,0,0,0,0,0,0,null,null,null,null,null,null,null,null,null,0,null,"","","",null,null,null,null,null,null,null,null,null,null,null,null,null,"","",0,"",6,"",null,null,null,"","","","","","","","","","","","","","","","","","","","","","","","","","",0,26,"","",{"$f":"IF(OR(DM59=\"\",DL59<2),\"\",IF(AND(OR(H30>=$AU$7,H30>=$AU$6),COUNTIF($DS$54:$DS$78,DS59)>1),H30,\"\"))","v":""},"",0,25,"","",{"$f":"IF($FB59=\"\",\"\",INDEX($H$25:$H$49,$DN30))","v":""},"",0,"","",{"$f":"IF(OR(FG59=0,COUNTIF($FF$54:$FF$78,FG59)=0),\"\",IF(FG59=$EV$53,$BA$23,MATCH(FG59,$FF$54:$FF$78,0)))","v":""},"",1,0,"","",1,0,"","",1,0,"","",1,0,"","",1,0,"","",1,0,"","",1,0,"","",1,0,"","",1,0,"","",1,0,"","",1,0,"","",1,0,"","",1,0,"","",1,0,"","",1,0,"","",1,0,"","",1,0,"","",1,0,"","",1,0,"","",1,0,"","",1,0,"","",1,0,"","",1,0,"","",1,0]
[null,null,null,null,null,null,null,null,null,null,null,null,null,null,null,null,null,null,null,null,null,null,null,null,null,null,null,null,null,null,null,null,null,null,null,null,null,null,null,null,null,null,null,null,null,{"$f":"IF($F31=\"\",\"\",IF($F31=$F$25,$AW$25,IF($F31=$F$26,$AW$26,IF($F31=$F$27,$AW$27,IF($F31=$F$28,$AW$28,IF($F31=$F$29,$AW$29,IF($F31=$F$30,$AW$30,\"\")))))))","v":""},{"$f":"IF($F31=\"\",\"\",IF($F31=$F$32,$AW$32,IF($F31=$F$33,$AW$33,IF($F31=$F$34,$AW$34,IF($F31=$F$35,$AW$35,IF($F31=$F$36,$AW$36,IF($F31=$F$37,$AW$37,\"\")))))))","v":""},"","",0,"","","","","",7,null,{"$f":"IF(BG60=0,\"\",IF(AND(BB60=\"\",BG60=BH60+BI60),1,IF(AND($BB$79<>\"\",BB60=$BB$79),1,0)))","v":""},0,0,0,0,0,0,0,0,0,0,0,0,0,0,0,0,0,0,0,0,0,0,0,0,0,0,0,0,null,null,null,null,null,null,null,null,null,0,null,"","","",null,null,null,null,null,null,null,null,null,null,null,null,null,"","",0,"",7,"",null,null,null,"","","","","","","","","","","","","","","","","","","","","","","","","","",0,26,"","","",{"$f":"IF(OR(FF60=\"\",FG60=\"\"),\"\",IF(H31>=1,EY60+ES60+FD60,\"\"))","v":""},0,25,"","",{"$f":"IF($FB60=\"\",\"\",INDEX($H$25:$H$49,$DN31))","v":""},{"$f":"IF(OR(FF60=\"\",FG60=\"\"),\"\",IF(AND(Q31<>\"\",$EV$53<>\"\",D31<>\"s\",H31>=$AU$7,B31=\"nc\"),Q31,FE60+FK60+FO60+FS60+FW60+GA60+GE60+GI60+GM60+GQ60+GU60+GY60+HC60+HG60+HK60+HO60+HS60+HW60+IA60+IE60+II60+IM60+IQ60+IU60+IY60))","v":""},0,"","",{"$f":"IF(OR(FG60=0,COUNTIF($FF$54:$FF$78,FG60)=0),\"\",IF(FG60=$EV$53,$BA$23,MATCH(FG60,$FF$54:$FF$78,0)))","v":""},"",1,0,"","",1,0,"","",1,0,"","",1,0,"","",1,0,"","",1,0,"","",1,0,"","",1,0,"","",1,0,"","",1,0,"","",1,0,"","",1,0,"","",1,0,"","",1,0,"","",1,0,"","",1,0,"","",1,0,"","",1,0,"","",1,0,"","",1,0,"","",1,0,"","",1,0,"","",1,0,"","",1,0]
[null,null,null,null,null,null,null,null,null,null,null,null,null,null,null,null,null,null,null,null,null,null,null,null,null,null,null,null,null,null,null,null,null,null,null,null,null,null,null,null,null,null,null,null,null,"",{"$f":"IF($F32=\"\",\"\",IF($F32=$F$31,$AW$31,IF($F32=$F$33,$AW$33,IF($F32=$F$34,$AW$34,IF($F32=$F$35,$AW$35,IF($F32=$F$36,$AW$36,IF($F32=$F$37,$AW$37,\"\")))))))","v":""},"","",0,"","","","","",8,null,"",0,0,0,0,0,0,0,0,0,0,0,0,0,0,0,0,0,0,0,0,0,0,0,0,0,0,0,0,null,null,null,null,null,null,null,null,null,0,null,"","","",null,null,null,null,null,null,null,null,null,null,null,null,null,"","",0,"",8,"",null,null,null,"","","","","","","","","","","","","","","","","","","","","","","","","","",{"$f":"IF(OR(D32=\"s\",H32<=$AU$7),0,IF(AND($EV$53<>\"\",D32<>\"s\",H32>=$AU$6,B32=\"c\"),ET61*$ES$53,IF(AND(Q32<>\"\",$EV$53<>\"\",D32<>\"s\",H32>=$AU$7,B32=\"nc\"),$ES$53-Q32,0)))","v":0},26,"","","",{"$f":"IF(OR(FF61=\"\",FG61=\"\"),\"\",IF(H32>=1,EY61+ES61+FD61,\"\"))","v":""},0,25,"","",{"$f":"IF($FB61=\"\",\"\",INDEX($H$25:$H$49,$DN32))","v":""},{"$f":"IF(OR(FF61=\"\",FG61=\"\"),\"\",IF(AND(Q32<>\"\",$EV$53<>\"\",D32<>\"s\",H32>=$AU$7,B32=\"nc\"),Q32,FE61+FK61+FO61+FS61+FW61+GA61+GE61+GI61+GM61+GQ61+GU61+GY61+HC61+HG61+HK61+HO61+HS61+HW61+IA61+IE61+II61+IM61+IQ61+IU61+IY61))","v":""},0,"","",{"$f":"IF(OR(FG61=0,COUNTIF($FF$54:$FF$78,FG61)=0),\"\",IF(FG61=$EV$53,$BA$23,MATCH(FG61,$FF$54:$FF$78,0)))","v":""},"",1,0,"","",1,0,"","",1,0,"","",1,0,"","",1,0,"","",1,0,"","",1,0,"","",1,0,"","",1,0,"","",1,0,"","",1,0,"","",1,0,"","",1,0,"","",1,0,"","",1,0,"","",1,0,"","",1,0,"","",1,0,"","",1,0,"","",1,0,"","",1,0,"","",1,0,"","",1,0,"","",1,0]
[null,null,null,null,null,null,null,null,null,null,null,null,null,null,null,null,null,null,null,null,null,null,null,null,null,null,null,null,null,null,null,null,null,null,null,null,null,null,null,null,null,null,null,null,null,"",{"$f":"IF($F33=\"\",\"\",IF($F33=$F$31,$AW$31,IF($F33=$F$32,$AW$32,IF($F33=$F$34,$AW$34,IF($F33=$F$35,$AW$35,IF($F33=$F$36,$AW$36,IF($F33=$F$37,$AW$37,\"\")))))))","v":""},"","",0,"","","","",{"$f":"IF(OR($BB62=\"\",$DT62=\"\"),\"\",25-COUNTBLANK($DT62:$ER62))","v":""},9,null,"",0,0,0,0,0,0,0,0,0,0,0,0,0,0,0,0,0,0,0,0,0,0,0,0,0,0,0,0,null,null,null,null,null,null,null,null,null,0,null,"","","",null,null,null,null,null,null,null,null,null,null,null,null,null,"","",0,"",9,"",null,null,null,"","","","","","","","","","","","","","","","","","","","","","","","","","",0,26,"","","","",0,25,"","",{"$f":"IF($FB62=\"\",\"\",INDEX($H$25:$H$49,$DN33))","v":""},"",0,"","","","",1,0,"","",1,0,"","",1,0,"","",1,0,"","",1,0,"","",1,0,"","",1,0,"","",1,0,"","",1,0,"","",1,0,"","",1,0,"","",1,0,"","",1,0,"","",1,0,"","",1,0,"","",1,0,"","",1,0,"","",1,0,"","",1,0,"","",1,0,"","",1,0,"","",1,0,"","",1,0,"","",1,0]
[null,null,null,null,null,null,null,null,null,null,null,null,null,null,null,null,null,null,null,null,null,null,null,null,null,null,null,null,null,null,null,null,null,null,null,null,null,null,null,null,null,null,null,null,null,"",{"$f":"IF($F34=\"\",\"\",IF($F34=$F$31,$AW$31,IF($F34=$F$32,$AW$32,IF($F34=$F$33,$AW$33,IF($F34=$F$35,$AW$35,IF($F34=$F$36,$AW$36,IF($F34=$F$37,$AW$37,\"\")))))))","v":""},"","",0,"","","","","",10,null,"",0,0,0,0,0,0,0,0,0,0,0,0,0,0,0,0,0,0,0,0,0,0,0,0,0,0,0,0,null,null,null,null,null,null,null,null,null,0,null,"","","",null,null,null,null,null,null,null,null,null,null,null,null,null,"","",0,"",10,"",null,null,null,"","","","","","","","","","","","","","","","","","","","","","","","","","",0,26,"","","","",0,25,"","",{"$f":"IF($FB63=\"\",\"\",INDEX($H$25:$H$49,$DN34))","v":""},"",0,"","","","",1,0,"","",1,0,"","",1,0,"","",1,0,"","",1,0,"","",1,0,"","",1,0,"","",1,0,"","",1,0,"","",1,0,"","",1,0,"","",1,0,"","",1,0,"","",1,0,"","",1,0,"","",1,0,"","",1,0,"","",1,0,"","",1,0,"","",1,0,"","",1,0,"","",1,0,"","",1,0,"","",1,0]
[null,null,null,null,null,null,null,null,null,null,null,null,null,null,null,null,null,null,null,null,null,null,null,null,null,null,null,null,null,null,null,null,null,null,null,null,null,null,null,null,null,null,null,null,null,"",{"$f":"IF($F35=\"\",\"\",IF($F35=$F$31,$AW$31,IF($F35=$F$32,$AW$32,IF($F35=$F$33,$AW$33,IF($F35=$F$34,$AW$34,IF($F35=$F$36,$AW$36,IF($F35=$F$37,$AW$37,\"\")))))))","v":""},"","",0,"","","","","",11,null,"",0,0,0,0,0,0,0,0,0,0,0,0,0,0,0,0,0,0,0,0,0,0,0,0,0,0,0,0,null,null,null,null,null,null,null,null,null,0,null,"","","",null,null,null,null,null,null,null,null,null,null,null,null,null,"","",0,"",11,"",null,null,null,"","","","","","","","","","","","","","","","","","","","","","","","","","",0,26,"","","","",0,25,"","",{"$f":"IF($FB64=\"\",\"\",INDEX($H$25:$H$49,$DN35))","v":""},"",0,"","","","",1,0,"","",1,0,"","",1,0,"","",1,0,"","",1,0,"","",1,0,"","",1,0,"","",1,0,"","",1,0,"","",1,0,"","",1,0,"","",1,0,"","",1,0,"","",1,0,"","",1,0,"","",1,0,"","",1,0,"","",1,0,"","",1,0,"","",1,0,"","",1,0,"","",1,0,"","",1,0,"","",1,0]
[null,null,null,null,null,null,null,null,null,null,null,null,null,null,null,null,null,null,null,null,null,null,null,null,null,null,null,null,null,null,null,null,null,null,null,null,null,null,null,null,null,null,null,null,null,"",{"$f":"IF($F36=\"\",\"\",IF($F36=$F$31,$AW$31,IF($F36=$F$32,$AW$32,IF($F36=$F$33,$AW$33,IF($F36=$F$34,$AW$34,IF($F36=$F$35,$AW$35,IF($F36=$F$37,$AW$37,\"\")))))))","v":""},"","",0,"","","","","",12,null,"",0,0,0,0,0,0,0,0,0,0,0,0,0,0,0,0,0,0,0,0,0,0,0,0,0,0,0,0,null,null,null,null,null,null,null,null,null,0,null,"","","",null,null,null,null,null,null,null,null,null,null,null,null,null,"","",0,"",12,"",null,null,null,"","","","","","","","","","","","","","","","","","","","","","","","","","",0,26,"","","","",0,25,"","",{"$f":"IF($FB65=\"\",\"\",INDEX($H$25:$H$49,$DN36))","v":""},"",0,"","","","",1,0,"","",1,0,"","",1,0,"","",1,0,"","",1,0,"","",1,0,"","",1,0,"","",1,0,"","",1,0,"","",1,0,"","",1,0,"","",1,0,"","",1,0,"","",1,0,"","",1,0,"","",1,0,"","",1,0,"","",1,0,"","",1,0,"","",1,0,"","",1,0,"","",1,0,"","",1,0,"","",1,0]
[null,null,null,null,null,null,null,null,null,null,null,null,null,null,null,null,null,null,null,null,null,null,null,null,null,null,null,null,null,null,null,null,null,null,null,null,null,null,null,null,null,null,null,null,null,"",{"$f":"IF($F37=\"\",\"\",IF($F37=$F$31,$AW$31,IF($F37=$F$32,$AW$32,IF($F37=$F$33,$AW$33,IF($F37=$F$34,$AW$34,IF($F37=$F$35,$AW$35,IF($F37=$F$36,$AW$36,\"\")))))))","v":""},"","",0,"","","","","",13,null,"",0,0,0,0,0,0,0,0,0,0,0,0,0,0,0,0,0,0,0,0,0,0,0,0,0,0,0,0,null,null,null,null,null,null,null,null,null,0,null,"","","",null,null,null,null,null,null,null,null,null,null,null,null,null,"","",0,"",13,"",null,null,null,"","","","","","","","","","","","","","","","","","","","","","","","","","",0,26,"","","","",0,25,"","",{"$f":"IF($FB66=\"\",\"\",INDEX($H$25:$H$49,$DN37))","v":""},"",0,"","","","",1,0,"","",1,0,"","",1,0,"","",1,0,"","",1,0,"","",1,0,"","",1,0,"","",1,0,"","",1,0,"","",1,0,"","",1,0,"","",1,0,"","",1,0,"","",1,0,"","",1,0,"","",1,0,"","",1,0,"","",1,0,"","",1,0,"","",1,0,"","",1,0,"","",1,0,"","",1,0,"","",1,0]
[null,null,null,null,null,null,null,null,null,null,null,null,null,null,null,null,null,null,null,null,null,null,null,null,null,null,null,null,null,null,null,null,null,null,null,null,null,null,null,null,null,null,null,null,null,"","",{"$f":"IF($F38=\"\",\"\",IF($F38=$F$37,$AW$37,IF($F38=$F$39,$AW$39,IF($F38=$F$40,$AW$40,IF($F38=$F$41,$AW$41,IF($F38=$F$42,$AW$42,IF($F38=$F$43,$AW$43,IF($F38=$F$44,$AW$44,\"\"))))))))","v":""},"",0,"","","","","",14,null,"",0,0,0,0,0,0,0,0,0,0,0,0,0,0,0,0,0,0,0,0,0,0,0,0,0,0,0,0,null,null,null,null,null,null,null,null,null,0,null,"","","",null,null,null,null,null,null,null,null,null,null,null,null,null,"","",0,"",14,"",null,null,null,"","","","","","","","","","","","","","","","","","","","","","","","","","",0,26,"","","","",0,25,"","",{"$f":"IF($FB67=\"\",\"\",INDEX($H$25:$H$49,$DN38))","v":""},"",0,"","","","",1,0,"","",1,0,"","",1,0,"","",1,0,"","",1,0,"","",1,0,"","",1,0,"","",1,0,"","",1,0,"","",1,0,"","",1,0,"","",1,0,"","",1,0,"","",1,0,"","",1,0,"","",1,0,"","",1,0,"","",1,0,"","",1,0,"","",1,0,"","",1,0,"","",1,0,"","",1,0,"","",1,0]
[null,null,null,null,null,null,null,null,null,null,null,null,null,null,null,null,null,null,null,null,null,null,null,null,null,null,null,null,null,null,null,null,null,null,null,null,null,null,null,null,null,null,null,null,null,"","",{"$f":"IF($F39=\"\",\"\",IF($F39=$F$37,$AW$37,IF($F39=$F$38,$AW$38,IF($F39=$F$40,$AW$40,IF($F39=$F$41,$AW$41,IF($F39=$F$42,$AW$42,IF($F39=$F$43,$AW$43,IF($F39=$F$44,$AW$44,\"\"))))))))","v":""},"",0,"","","","","",15,null,"",0,0,0,0,0,0,0,0,0,0,0,0,0,0,0,0,0,0,0,0,0,0,0,0,0,0,0,0,null,null,null,null,null,null,null,null,null,0,null,"","","",null,null,null,null,null,null,null,null,null,null,null,null,null,"","",0,"",15,"",null,null,null,"","","","","","","","","","","","","","","","","","","","","","","","","","",0,26,"","","","",0,25,"","",{"$f":"IF($FB68=\"\",\"\",INDEX($H$25:$H$49,$DN39))","v":""},"",0,"","","","",1,0,"","",1,0,"","",1,0,"","",1,0,"","",1,0,"","",1,0,"","",1,0,"","",1,0,"","",1,0,"","",1,0,"","",1,0,"","",1,0,"","",1,0,"","",1,0,"","",1,0,"","",1,0,"","",1,0,"","",1,0,"","",1,0,"","",1,0,"","",1,0,"","",1,0,"","",1,0,"","",1,0]
[null,null,null,null,null,null,null,null,null,null,null,null,null,null,null,null,null,null,null,null,null,null,null,null,null,null,null,null,null,null,null,null,null,null,null,null,null,null,null,null,null,null,null,null,null,"","",{"$f":"IF($F40=\"\",\"\",IF($F40=$F$37,$AW$37,IF($F40=$F$38,$AW$38,IF($F40=$F$39,$AW$39,IF($F40=$F$41,$AW$41,IF($F40=$F$42,$AW$42,IF($F40=$F$43,$AW$43,IF($F40=$F$44,$AW$44,\"\"))))))))","v":""},"",0,"","","","","",16,null,"",0,0,0,0,0,0,0,0,0,0,0,0,0,0,0,0,0,0,0,0,0,0,0,0,0,0,0,0,null,null,null,null,null,null,null,null,null,0,null,"","","",null,null,null,null,null,null,null,null,null,null,null,null,null,"","",0,"",16,"",null,null,null,"","","","","","","","","","","","","","","","","","","","","","","","","","",0,26,"","","","",0,25,"","",{"$f":"IF($FB69=\"\",\"\",INDEX($H$25:$H$49,$DN40))","v":""},"",0,"","","","",1,0,"","",1,0,"","",1,0,"","",1,0,"","",1,0,"","",1,0,"","",1,0,"","",1,0,"","",1,0,"","",1,0,"","",1,0,"","",1,0,"","",1,0,"","",1,0,"","",1,0,"","",1,0,"","",1,0,"","",1,0,"","",1,0,"","",1,0,"","",1,0,"","",1,0,"","",1,0,"","",1,0]
[null,null,null,null,null,null,null,null,null,null,null,null,null,null,null,null,null,null,null,null,null,null,null,null,null,null,null,null,null,null,null,null,null,null,null,null,null,null,null,null,null,null,null,null,null,"","",{"$f":"IF($F41=\"\",\"\",IF($F41=$F$37,$AW$37,IF($F41=$F$38,$AW$38,IF($F41=$F$39,$AW$39,IF($F41=$F$40,$AW$40,IF($F41=$F$42,$AW$42,IF($F41=$F$43,$AW$43,IF($F41=$F$44,$AW$44,\"\"))))))))","v":""},"",0,"","","","","",17,null,"",0,0,0,0,0,0,0,0,0,0,0,0,0,0,0,0,0,0,0,0,0,0,0,0,0,0,0,0,null,null,null,null,null,null,null,null,null,0,null,"","","",null,null,null,null,null,null,null,null,null,null,null,null,null,"","",0,"",17,"",null,null,null,"","","","","","","","","","","","","","","","","","","","","","","","","","",0,26,"","","","",0,25,"","",{"$f":"IF($FB70=\"\",\"\",INDEX($H$25:$H$49,$DN41))","v":""},"",0,"","","","",1,0,"","",1,0,"","",1,0,"","",1,0,"","",1,0,"","",1,0,"","",1,0,"","",1,0,"","",1,0,"","",1,0,"","",1,0,"","",1,0,"","",1,0,"","",1,0,"","",1,0,"","",1,0,"","",1,0,"","",1,0,"","",1,0,"","",1,0,"","",1,0,"","",1,0,"","",1,0,"","",1,0]
[null,null,null,null,null,null,null,null,null,null,null,null,null,null,null,null,null,null,null,null,null,null,null,null,null,null,null,null,null,null,null,null,null,null,null,null,null,null,null,null,null,null,null,null,null,"","",{"$f":"IF($F42=\"\",\"\",IF($F42=$F$37,$AW$37,IF($F42=$F$38,$AW$38,IF($F42=$F$39,$AW$39,IF($F42=$F$40,$AW$40,IF($F42=$F$41,$AW$41,IF($F42=$F$43,$AW$43,IF($F42=$F$44,$AW$44,\"\"))))))))","v":""},"",0,"","","","","",18,null,"",0,0,0,0,0,0,0,0,0,0,0,0,0,0,0,0,0,0,0,0,0,0,0,0,0,0,0,0,null,null,null,null,null,null,null,null,null,0,null,"","","",null,null,null,null,null,null,null,null,null,null,null,null,null,"","",0,"",18,"",null,null,null,"","","","","","","","","","","","","","","","","","","","","","","","","","",0,26,"","","","",0,25,"","",{"$f":"IF($FB71=\"\",\"\",INDEX($H$25:$H$49,$DN42))","v":""},"",0,"","","","",1,0,"","",1,0,"","",1,0,"","",1,0,"","",1,0,"","",1,0,"","",1,0,"","",1,0,"","",1,0,"","",1,0,"","",1,0,"","",1,0,"","",1,0,"","",1,0,"","",1,0,"","",1,0,"","",1,0,"","",1,0,"","",1,0,"","",1,0,"","",1,0,"","",1,0,"","",1,0,"","",1,0]
[null,null,null,null,null,null,null,null,null,null,null,null,null,null,null,null,null,null,null,null,null,null,null,null,null,null,null,null,null,null,null,null,null,null,null,null,null,null,null,null,null,null,null,null,null,"","",{"$f":"IF($F43=\"\",\"\",IF($F43=$F$37,$AW$37,IF($F43=$F$38,$AW$38,IF($F43=$F$39,$AW$39,IF($F43=$F$40,$AW$40,IF($F43=$F$41,$AW$41,IF($F43=$F$42,$AW$42,IF($F43=$F$44,$AW$44,\"\"))))))))","v":""},"",0,"","","","","",19,null,"",0,0,0,0,0,0,0,0,0,0,0,0,0,0,0,0,0,0,0,0,0,0,0,0,0,0,0,0,null,null,null,null,null,null,null,null,null,0,null,"","","",null,null,null,null,null,null,null,null,null,null,null,null,null,"","",0,"",19,"",null,null,null,"","","","","","","","","","","","","","","","","","","","","","","","","","",0,26,"","","","",0,25,"","",{"$f":"IF($FB72=\"\",\"\",INDEX($H$25:$H$49,$DN43))","v":""},"",0,"","","","",1,0,"","",1,0,"","",1,0,"","",1,0,"","",1,0,"","",1,0,"","",1,0,"","",1,0,"","",1,0,"","",1,0,"","",1,0,"","",1,0,"","",1,0,"","",1,0,"","",1,0,"","",1,0,"","",1,0,"","",1,0,"","",1,0,"","",1,0,"","",1,0,"","",1,0,"","",1,0,"","",1,0]
[null,null,null,null,null,null,null,null,null,null,null,null,null,null,null,null,null,null,null,null,null,null,null,null,null,null,null,null,null,null,null,null,null,null,null,null,null,null,null,null,null,null,null,null,null,"","",{"$f":"IF($F44=\"\",\"\",IF($F44=$F$37,$AW$37,IF($F44=$F$38,$AW$38,IF($F44=$F$39,$AW$39,IF($F44=$F$40,$AW$40,IF($F44=$F$41,$AW$41,IF($F44=$F$42,$AW$42,IF($F44=$F$43,$AW$43,\"\"))))))))","v":""},"",0,"","","","","",20,null,"",0,0,0,0,0,0,0,0,0,0,0,0,0,0,0,0,0,0,0,0,0,0,0,0,0,0,0,0,null,null,null,null,null,null,null,null,null,0,null,"","","",null,null,null,null,null,null,null,null,null,null,null,null,null,"","",0,"",20,"",null,null,null,"","","","","","","","","","","","","","","","","","","","","","","","","","",0,26,"","","","",0,25,"","",{"$f":"IF($FB73=\"\",\"\",INDEX($H$25:$H$49,$DN44))","v":""},"",0,"","","","",1,0,"","",1,0,"","",1,0,"","",1,0,"","",1,0,"","",1,0,"","",1,0,"","",1,0,"","",1,0,"","",1,0,"","",1,0,"","",1,0,"","",1,0,"","",1,0,"","",1,0,"","",1,0,"","",1,0,"","",1,0,"","",1,0,"","",1,0,"","",1,0,"","",1,0,"","",1,0,"","",1,0]
[null,null,null,null,null,null,null,null,null,null,null,null,null,null,null,null,null,null,null,null,null,null,null,null,null,null,null,null,null,null,null,null,null,null,null,null,null,null,null,null,null,null,null,null,null,"","","","",0,"","","","","",21,null,"",0,0,0,0,0,0,0,0,0,0,0,0,0,0,0,0,0,0,0,0,0,0,0,0,0,0,0,0,null,null,null,null,null,null,null,null,null,0,null,"","","",null,null,null,null,null,null,null,null,null,null,null,null,null,"","",0,"",21,"",null,null,null,"","","","","","","","","","","","","","","","","","","","","","","","","","",0,26,"","","","",0,25,"","",{"$f":"IF($FB74=\"\",\"\",INDEX($H$25:$H$49,$DN45))","v":""},"",0,"","","","",1,0,"","",1,0,"","",1,0,"","",1,0,"","",1,0,"","",1,0,"","",1,0,"","",1,0,"","",1,0,"","",1,0,"","",1,0,"","",1,0,"","",1,0,"","",1,0,"","",1,0,"","",1,0,"","",1,0,"","",1,0,"","",1,0,"","",1,0,"","",1,0,"","",1,0,"","",1,0,"","",1,0]
[null,null,null,null,null,null,null,null,null,null,null,null,null,null,null,null,null,null,null,null,null,null,null,null,null,null,null,null,null,null,null,null,null,null,null,null,null,null,null,null,null,null,null,null,null,"","","","",0,"","","","","",22,null,"",0,0,0,0,0,0,0,0,0,0,0,0,0,0,0,0,0,0,0,0,0,0,0,0,0,0,0,0,null,null,null,null,null,null,null,null,null,0,null,"","","",null,null,null,null,null,null,null,null,null,null,null,null,null,"","",0,"",22,"",null,null,null,"","","","","","","","","","","","","","","","","","","","","","","","","","",0,26,"","","","",0,25,"","",{"$f":"IF($FB75=\"\",\"\",INDEX($H$25:$H$49,$DN46))","v":""},"",0,"","","","",1,0,"","",1,0,"","",1,0,"","",1,0,"","",1,0,"","",1,0,"","",1,0,"","",1,0,"","",1,0,"","",1,0,"","",1,0,"","",1,0,"","",1,0,"","",1,0,"","",1,0,"","",1,0,"","",1,0,"","",1,0,"","",1,0,"","",1,0,"","",1,0,"","",1,0,"","",1,0,"","",1,0]
[null,null,null,null,null,null,null,null,null,null,null,null,null,null,null,null,null,null,null,null,null,null,null,null,null,null,null,null,null,null,null,null,null,null,null,null,null,null,null,null,null,null,null,null,null,"","","","",0,"","","","","",23,null,"",0,0,0,0,0,0,0,0,0,0,0,0,0,0,0,0,0,0,0,0,0,0,0,0,0,0,0,0,null,null,null,null,null,null,null,null,null,0,null,"","","",null,null,null,null,null,null,null,null,null,null,null,null,null,"","",0,"",23,"",null,null,null,"","","","","","","","","","","","","","","","","","","","","","","","","","",0,26,"","","","",0,25,"","",{"$f":"IF($FB76=\"\",\"\",INDEX($H$25:$H$49,$DN47))","v":""},"",0,"","","","",1,0,"","",1,0,"","",1,0,"","",1,0,"","",1,0,"","",1,0,"","",1,0,"","",1,0,"","",1,0,"","",1,0,"","",1,0,"","",1,0,"","",1,0,"","",1,0,"","",1,0,"","",1,0,"","",1,0,"","",1,0,"","",1,0,"","",1,0,"","",1,0,"","",1,0,"","",1,0,"","",1,0]
[null,null,null,null,null,null,null,null,null,null,null,null,null,null,null,null,null,null,null,null,null,null,null,null,null,null,null,null,null,null,null,null,null,null,null,null,null,null,null,null,null,null,null,null,null,"","","","",0,"","","","","",24,null,"",0,0,0,0,0,0,0,0,0,0,0,0,0,0,0,0,0,0,0,0,0,0,0,0,0,0,0,0,null,null,null,null,null,null,null,null,null,0,null,"","","",null,null,null,null,null,null,null,null,null,null,null,null,null,"","",0,"",24,"",null,null,null,"","","","","","","","","","","","","","","","","","","","","","","","","","",0,26,"","","","",0,25,"","",{"$f":"IF($FB77=\"\",\"\",INDEX($H$25:$H$49,$DN48))","v":""},"",0,"","","","",1,0,"","",1,0,"","",1,0,"","",1,0,"","",1,0,"","",1,0,"","",1,0,"","",1,0,"","",1,0,"","",1,0,"","",1,0,"","",1,0,"","",1,0,"","",1,0,"","",1,0,"","",1,0,"","",1,0,"","",1,0,"","",1,0,"","",1,0,"","",1,0,"","",1,0,"","",1,0,"","",1,0]
[null,null,null,null,null,null,null,null,null,null,null,null,null,null,null,null,null,null,null,null,null,null,null,null,null,null,null,null,null,null,null,null,null,null,null,null,null,null,null,null,null,null,null,null,null,"","","","",0,"","","","","",25,null,"",0,0,0,0,0,0,0,0,0,0,0,0,0,0,0,0,0,0,0,0,0,0,0,0,0,0,0,0,null,null,null,null,null,null,null,null,null,0,null,"","","",null,null,null,null,null,null,null,null,null,null,null,null,null,"","",0,"",25,"",null,null,null,"","","","","","","","","","","","","","","","","","","","","","","","","","",0,26,"","","","",0,25,"","",{"$f":"IF($FB78=\"\",\"\",INDEX($H$25:$H$49,$DN49))","v":""},"",0,"","","","",1,0,"","",1,0,"","",1,0,"","",1,0,"","",1,0,"","",1,0,"","",1,0,"","",1,0,"","",1,0,"","",1,0,"","",1,0,"","",1,0,"","",1,0,"","",1,0,"","",1,0,"","",1,0,"","",1,0,"","",1,0,"","",1,0,"","",1,0,"","",1,0,"","",1,0,"","",1,0,"","",1,0]
[null,null,null,null,null,null,null,null,null,null,null,null,null,null,null,null,null,null,null,null,null,null,null,null,null,null,null,null,null,null,null,null,null,null,null,null,null,null,null,null,null,null,null,null,null,null,null,null,null,{"$f":"IF(BD79<>\"\",LOOKUP(BD79,$DN$54:$DN$78,AX54:AX78),IF(AT85=\"S1\",MIN($AX$54:$AX$78),MAX($AX$54:$AX$78)))","v":0},null,null,"Pos. Máx. (crítico)",{"$f":"IF(BC79=0,\"\",MATCH(BC79,$BC$54:$BC$78,0))","v":""},{"$f":"MAX($BC$54:$BC$78)","v":0},{"$f":"IF(MAX(BD54:BD78)=0,\"\",MAX(BD54:BD78))","v":25},null,null,null,null,null,null,null,null,null,null,null,null,null,null,null,null,null,null,null,null,null,null,null,null,null,null,null,null,null,null,null,null,null,null,null,null,null,null,null,0,null,"","","",null,null,null,null,null,null,null,null,null,null,null,null,null,null,null,null,null,null,null,null,null,null,null,null,null,null,null,null,null,null,null,null,null,null,null,null,null,null,null,null,null,null,null,null,null,null,null,null,null,null,null,null,null,null,"Nº Sprink. Sim. Alim. pelas bifurcações"]
[null,null,null,null,null,null,null,null,null,null,null,null,null,null,null,null,null,null,null,null,null,null,null,null,null,null,null,null,null,null,null,null,null,null,null,null,null,null,null,null,null,null,null,null,null,null,null,null,null,null,null,null,"Pos. Mín. (não crítico)",{"$f":"IF(BC80=0,\"\",IF(AND(BC79>0,BC80>0,BC79=BC80),MAX(BB54:BB78),MATCH(BC80,$BC$54:$BC$78,0)))","v":""},{"$f":"MIN($BC$54:$BC$78)","v":0},null,null,null,null,null,null,null,null,null,null,null,null,null,null,null,null,null,null,null,null,null,null,null,null,null,null,null,null,null,null,null,null,null,null,null,null,null,null,null,null,null,null,null,null,null,null,null,null,null,null,null,null,null,null,null,null,null,null,null,null,null,null,null,null,null,null,null,null,null,null,null,null,null,null,null,null,null,null,null,null,null,null,null,null,null,null,null,null,null,null,null,null,null,null,null,null,null,null,null,{"$f":"IF($FC$53=0,\"\",1)","v":""},{"$f":"IF(EY80<>\"\",SMALL($FC$54:$FC$78,EY80),\"\")","v":""},{"$f":"IF(EZ80=\"\",\"\",MATCH(EZ80,$FC$54:$FC$78,0))","v":""},{"$f":"IF(FA80=\"\",\"\",INDEX($FB$54:$FB$78,FA80))","v":""},"Explicitação automática das alturas piezométricas de todos os caminhos, incluindo o crítico:",null,null,null,{"$f":"FG22","v":1},null,{"$f":"FG80+1","v":2},null,null,{"$f":"FI80+1","v":3},null,null,null,{"$f":"FL80+1","v":4},null,null,null,{"$f":"FP80+1","v":5},null,null,null,{"$f":"FT80+1","v":6},null,null,null,{"$f":"FX80+1","v":7},null,null,null,{"$f":"GB80+1","v":8},null,null,null,{"$f":"GF80+1","v":9},null,null,null,{"$f":"GJ80+1","v":10},null,null,null,{"$f":"GN80+1","v":11},null,null,null,{"$f":"GR80+1","v":12},null,null,null,{"$f":"GV80+1","v":13},null,null,null,{"$f":"GZ80+1","v":14},null,null,null,{"$f":"HD80+1","v":15},null,null,null,{"$f":"HH80+1","v":16},null,null,null,{"$f":"HL80+1","v":17},null,null,null,{"$f":"HP80+1","v":18},null,null,null,{"$f":"HT80+1","v":19},null,null,null,{"$f":"HX80+1","v":20},null,null,null,{"$f":"IB80+1","v":21},null,null,null,{"$f":"IF80+1","v":22},null,null,null,{"$f":"IJ80+1","v":23},null,null,null,{"$f":"IN80+1","v":24},null,null,null,{"$f":"IR80+1","v":25}]
[null,null,null,null,null,null,null,null,null,null,null,null,null,null,null,null,null,null,null,null,null,null,null,null,null,null,null,null,null,null,null,null,null,null,null,null,null,null,null,null,null,null,null,null,null,null,null,null,null,null,null,null,null,"Afectação de Caudais de Cálculo dos Sprinklers",null,null,null,null,null,null,null,null,null,null,null,null,null,null,null,null,null,null,null,null,null,null,null,null,null,null,null,null,null,null,null,null,null,null,null,null,null,null,null,null,null,null,null,null,null,null,null,null,null,null,null,null,null,null,null,null,null,null,null,null,null,null,null,null,null,null,null,null,null,null,null,null,null,null,null,null,null,null,null,null,null,null,null,null,null,null,null,null,null,null,null,null,null,null,null,null,null,null,null,null,{"$f":"IF($FC$53=0,\"\",IF(EY80<$FC$53,EY80+1,IF(EY80=$FC$53,\"\",\"\")))","v":""},{"$f":"IF(EY81<>\"\",SMALL($FC$54:$FC$78,EY81),\"\")","v":""},{"$f":"IF(EZ81=\"\",\"\",MATCH(EZ81,$FC$54:$FC$78,0))","v":""},{"$f":"IF(FA81=\"\",\"\",INDEX($FB$54:$FB$78,FA81))","v":""},"Determinação do Caminho Crítico",null,null,"Nó Inicial","Nó Final","h1)","Nó antecedente",null,"Troço",null,"Nó antecedente",null,"Troço",null,"Nó antecedente",null,"Troço",null,"Nó antecedente",null,"Troço",null,"Nó antecedente",null,"Troço",null,"Nó antecedente",null,"Troço",null,"Nó antecedente",null,"Troço",null,"Nó antecedente",null,"Troço",null,"Nó antecedente",null,"Troço",null,"Nó antecedente",null,"Troço",null,"Nó antecedente",null,"Troço",null,"Nó antecedente",null,"Troço",null,"Nó antecedente",null,"Troço",null,"Nó antecedente",null,"Troço",null,"Nó antecedente",null,"Troço",null,"Nó antecedente",null,"Troço",null,"Nó antecedente",null,"Troço",null,"Nó antecedente",null,"Troço",null,"Nó antecedente",null,"Troço",null,"Nó antecedente",null,"Troço",null,"Nó antecedente",null,"Troço",null,"Nó antecedente",null,"Troço",null,"Nó antecedente",null,"Troço",null,"Nó antecedente",null,"Troço"]
[null,null,null,null,null,null,null,null,null,null,null,null,null,null,null,null,null,null,null,null,null,null,null,null,null,null,null,null,null,null,null,null,null,null,null,null,null,null,null,null,null,null,null,null,null,"Caudais referentes ao Sub-Ramal 1 do troço crítico",null,null,null,null,null,null,null,"conforme nº de sprinklers da Bifurcação:",null,null,null,null,null,null,null,null,null,null,null,null,null,null,null,null,null,null,null,null,null,null,null,null,null,null,null,null,null,null,null,null,null,null,null,null,null,null,null,null,null,null,null,null,null,null,null,null,null,null,null,null,null,null,null,null,null,null,null,null,null,null,null,null,null,null,null,null,null,null,null,null,null,null,null,null,null,null,null,null,null,null,null,null,null,null,null,null,null,null,null,null,null,null,null,null,null,null,"Nº",null,"","","","","Cota piezométrica máxima",null,{"$f":"MAX(FE83:FE107)","v":0},null,null,"m",null,null,"(m)",null,null,null,"(m)",null,null,null,"(m)",null,null,null,"(m)",null,null,null,"(m)",null,null,null,"(m)",null,null,null,"(m)",null,null,null,"(m)",null,null,null,"(m)",null,null,null,"(m)",null,null,null,"(m)",null,null,null,"(m)",null,null,null,"(m)",null,null,null,"(m)",null,null,null,"(m)",null,null,null,"(m)",null,null,null,"(m)",null,null,null,"(m)",null,null,null,"(m)",null,null,null,"(m)",null,null,null,"(m)",null,null,null,"(m)",null,null,null,"(m)",null,null,null,"(m)"]
[null,null,null,null,null,null,null,null,null,null,null,null,null,null,null,null,null,null,null,null,null,null,null,null,null,null,null,null,null,null,null,null,null,null,null,null,null,null,null,null,null,null,null,null,null,null,"NSsim.troço","Qacum.","Qs",null,"Troço","Qs","Qacum.",null,"Qacum.",null,"Qacum.",null,null,null,"Leq","h1)","Di","J","ΔP","Pi","Pf","Pfc","V ",null,null,null,"Di cálculo","Di imposto","Dinterior","Di","Gama de","Gama de",null,null,null,null,null,null,null,null,null,null,null,null,null,null,null,null,null,null,null,null,null,null,null,null,null,null,null,null,null,null,null,null,null,null,null,null,null,null,null,null,null,null,null,null,null,null,null,null,null,null,null,null,null,null,null,null,null,null,null,null,null,null,null,null,null,null,null,null,null,null,null,null,null,null,1,null,"","","","",{"$f":"IF(OR(FE83=\"\",FE83=0),\"\",IF(FE83=$FE$82,\"Crítico\",\"\"))","v":""},{"$f":"IF(FC83=\"\",\"\",1)","v":""},{"$f":"FH83+FK83+FO83+FS83+FW83+GA83+GE83+GI83+GM83+GQ83+GU83+GY83+HC83+HG83+HK83+HO83+HS83+HW83+IA83+IE83+II83+IM83+IQ83+IU83+IY83","v":0},{"$f":"FF25","v":0},0,{"$f":"IF(OR($K25=\"\",FG25=\"\"),0,$K25)","v":0},null,{"$f":"FJ25","v":""},{"$f":"IF(FJ83=\"\",0,LOOKUP(FJ83,$EW$83:$EW$107,$FH$83:$FH$107))","v":0},null,null,{"$f":"FN25","v":""},{"$f":"IF(FN83=\"\",0,LOOKUP(FN83,$EW$83:$EW$107,$FH$83:$FH$107))","v":0},null,null,{"$f":"FR25","v":""},{"$f":"IF(FR83=\"\",0,LOOKUP(FR83,$EW$83:$EW$107,$FH$83:$FH$107))","v":0},null,null,{"$f":"FV25","v":""},{"$f":"IF(FV83=\"\",0,LOOKUP(FV83,$EW$83:$EW$107,$FH$83:$FH$107))","v":0},null,null,{"$f":"FZ25","v":""},{"$f":"IF(FZ83=\"\",0,LOOKUP(FZ83,$EW$83:$EW$107,$FH$83:$FH$107))","v":0},null,null,{"$f":"GD25","v":""},{"$f":"IF(GD83=\"\",0,LOOKUP(GD83,$EW$83:$EW$107,$FH$83:$FH$107))","v":0},null,null,{"$f":"GH25","v":""},{"$f":"IF(GH83=\"\",0,LOOKUP(GH83,$EW$83:$EW$107,$FH$83:$FH$107))","v":0},null,null,{"$f":"GL25","v":""},{"$f":"IF(GL83=\"\",0,LOOKUP(GL83,$EW$83:$EW$107,$FH$83:$FH$107))","v":0},null,null,{"$f":"GP25","v":""},{"$f":"IF(GP83=\"\",0,LOOKUP(GP83,$EW$83:$EW$107,$FH$83:$FH$107))","v":0},null,null,{"$f":"GT25","v":""},{"$f":"IF(GT83=\"\",0,LOOKUP(GT83,$EW$83:$EW$107,$FH$83:$FH$107))","v":0},null,null,{"$f":"GX25","v":""},{"$f":"IF(GX83=\"\",0,LOOKUP(GX83,$EW$83:$EW$107,$FH$83:$FH$107))","v":0},null,null,{"$f":"HB25","v":""},{"$f":"IF(HB83=\"\",0,LOOKUP(HB83,$EW$83:$EW$107,$FH$83:$FH$107))","v":0},null,null,{"$f":"HF25","v":""},{"$f":"IF(HF83=\"\",0,LOOKUP(HF83,$EW$83:$EW$107,$FH$83:$FH$107))","v":0},null,null,{"$f":"HJ25","v":""},{"$f":"IF(HJ83=\"\",0,LOOKUP(HJ83,$EW$83:$EW$107,$FH$83:$FH$107))","v":0},null,null,{"$f":"HN25","v":""},{"$f":"IF(HN83=\"\",0,LOOKUP(HN83,$EW$83:$EW$107,$FH$83:$FH$107))","v":0},null,null,{"$f":"HR25","v":""},{"$f":"IF(HR83=\"\",0,LOOKUP(HR83,$EW$83:$EW$107,$FH$83:$FH$107))","v":0},null,null,{"$f":"HV25","v":""},{"$f":"IF(HV83=\"\",0,LOOKUP(HV83,$EW$83:$EW$107,$FH$83:$FH$107))","v":0},null,null,{"$f":"HZ25","v":""},{"$f":"IF(HZ83=\"\",0,LOOKUP(HZ83,$EW$83:$EW$107,$FH$83:$FH$107))","v":0},null,null,{"$f":"ID25","v":""},{"$f":"IF(ID83=\"\",0,LOOKUP(ID83,$EW$83:$EW$107,$FH$83:$FH$107))","v":0},null,null,{"$f":"IH25","v":""},{"$f":"IF(IH83=\"\",0,LOOKUP(IH83,$EW$83:$EW$107,$FH$83:$FH$107))","v":0},null,null,{"$f":"IL25","v":""},{"$f":"IF(IL83=\"\",0,LOOKUP(IL83,$EW$83:$EW$107,$FH$83:$FH$107))","v":0},null,null,{"$f":"IP25","v":""},{"$f":"IF(IP83=\"\",0,LOOKUP(IP83,$EW$83:$EW$107,$FH$83:$FH$107))","v":0},null,null,{"$f":"IT25","v":""},{"$f":"IF(IT83=\"\",0,LOOKUP(IT83,$EW$83:$EW$107,$FH$83:$FH$107))","v":0},null,null,{"$f":"IX25","v":""},{"$f":"IF(IX83=\"\",0,LOOKUP(IX83,$EW$83:$EW$107,$FH$83:$FH$107))","v":0}]
[null,null,null,null,null,null,null,null,null,null,null,null,null,null,null,null,null,null,null,null,null,null,null,null,null,null,null,null,null,null,null,null,null,null,null,null,null,null,null,null,null,null,null,null,null,"Nó final",{"$f":"IF($AU$7=\"\",\"\",IF(AND($AX$52<>0,$AU$7<>$AX$52),$AX$52,$AU$7))","v":4},{"$f":"BG4","v":"l/min"},{"$f":"AV84","v":"l/min"},null,"Não Crítico",{"$f":"IF(AU7=\"\",\"\",AU7-AU84)","v":0},{"$f":"SUM(BA85:BA93)","v":0},null,{"$f":"SUM(BC85:BC93)","v":0},null,{"$f":"SUM(BE85:BE93)","v":120},null,"Razão","Posição","m","m","mm","m/m",{"$f":"BN84","v":"kPa"},{"$f":"BL4","v":"kPa"},{"$f":"BN84","v":"kPa"},{"$f":"BO84","v":"kPa"},"m/s",null,null,null,"mm","mm","escolhido","mm","1/2 a 2 1/2","3 a 12\"",null,null,null,null,null,null,null,null,null,null,null,null,null,null,null,null,null,null,null,null,null,null,null,null,null,null,null,null,null,null,null,null,null,null,null,null,null,null,null,null,null,null,null,null,null,null,null,null,null,null,null,null,null,null,null,null,null,null,null,null,null,null,null,null,null,null,null,null,null,null,null,null,null,null,2,null,"","","","",{"$f":"IF(OR(FE84=\"\",FE84=0),\"\",IF(FE84=$FE$82,\"Crítico\",\"\"))","v":""},"",0,0,0,{"$f":"IF(OR($K26=\"\",FG26=\"\"),0,$K26)","v":0},null,{"$f":"FJ26","v":""},0,null,null,{"$f":"FN26","v":""},0,null,null,{"$f":"FR26","v":""},0,null,null,{"$f":"FV26","v":""},0,null,null,{"$f":"FZ26","v":""},0,null,null,{"$f":"GD26","v":""},0,null,null,{"$f":"GH26","v":""},0,null,null,{"$f":"GL26","v":""},0,null,null,{"$f":"GP26","v":""},0,null,null,{"$f":"GT26","v":""},0,null,null,{"$f":"GX26","v":""},0,null,null,{"$f":"HB26","v":""},0,null,null,{"$f":"HF26","v":""},0,null,null,{"$f":"HJ26","v":""},0,null,null,{"$f":"HN26","v":""},0,null,null,{"$f":"HR26","v":""},0,null,null,{"$f":"HV26","v":""},0,null,null,{"$f":"HZ26","v":""},0,null,null,{"$f":"ID26","v":""},0,null,null,{"$f":"IH26","v":""},0,null,null,{"$f":"IL26","v":""},0,null,null,{"$f":"IP26","v":""},0,null,null,{"$f":"IT26","v":""},0,null,null,{"$f":"IX26","v":""},0]
[null,null,null,null,null,null,null,null,null,null,null,null,null,null,null,null,null,null,null,null,null,null,null,null,null,null,null,null,null,null,null,null,null,null,null,null,null,null,null,null,null,null,null,null,null,{"$f":"IF($EW$23=\"\",\"\",LOOKUP($EW$23,$EU$25:$EU$49,DT$25:DT$49))","v":""},{"$f":"$N$21","v":1},{"$f":"AW85","v":60},{"$f":"$AU$8","v":60},null,{"$f":"IF(OR($AZ$84=\"\",AZ85=\"\")=\"\",\"\",AZ84)","v":0},{"$f":"IFERROR(IF(OR(AU85=\"\",AW85=\"\"),\"\",LARGE($AW$85:$AW$93,AU85)),\"\")","v":60},{"$f":"IF(OR(AY85=\"\",AY85<1),\"\",AZ85)","v":""},1,{"$f":"IF($FB$53=\"\",\"\",IF($AZ$84=0,\"\",IF($AJ$6=\"x\",$AU$8,AZ85)))","v":""},{"$f":"IF(BB85>$AU$7,\"\",IF(AU85<>\"\",AU85,IF(AND(BB84=$AU$84,$BC$84<>0),1,BE84+1)))","v":1},{"$f":"IF(BD85=\"\",\"\",LOOKUP(BD85,$BB$85:$BB$93,$AZ$85:$AZ$93))","v":60},{"$f":"IF(BE85=\"\",\"\",BE85)","v":60},{"$f":"IF(BF85=\"\",\"\",BF85/$BE$84)","v":0.5},{"$f":"IF(OR(AT85=\"\",AU85=\"\"),\"\",MATCH(AT85,$G$25:$G$49,0))","v":""},{"$f":"IF(AND($EW$50>=2,EW23<>\"\"),LOOKUP(EW23,EU25:EU49,M25:M49),SUMIF($EW$25:$EW$49,\"1\",M25:M49))","v":0},{"$f":"IF(AND($EW$50>=2,EW23<>\"\"),LOOKUP(EW23,EU25:EU49,K25:K49),SUMIF($EW$25:$EW$49,\"1\",K25:K49))","v":0},{"$f":"IF(AU86=\"\",\"\",BX85)","v":27.3},{"$f":"IF(BK85=\"\",\"\",IF($M$15=\"\",61.7*100000*((AV85/$B$17)^1.85/($P$16^1.85*BK85^4.87)),(4*$P$16*((BQ85^7)/(BK85/1000))^(1/4))/(BK85/1000)))","v":0.17348725720026661},{"$f":"IF(BL85=\"\",\"\",BL85*BI85*$AU$19*$B$18)","v":0},{"$f":"IF(BM85=\"\",\"\",BO85+BM85)","v":56.25},{"$f":"IF(BP85=\"\",\"\",BP85+$B$18*$AU$19*BJ85)","v":56.25},{"$f":"$AU$9","v":56.25},{"$f":"IF(BK85=\"\",\"\",(66.7*AV85/$B$17)/(PI()*BK85^2))","v":1.7092355519429083},null,null,null,{"$f":"MAX(BV85,MIN('Quadro 1'!$G$12,'Quadro 1'!$G$16))","v":27.3},{"$f":"IF(SUM($EW$25:$EW$49)=25,\"\",LOOKUP(EW23,EU25:EU49,U25:U49))","v":""},{"$f":"IF(MAX(BR85:BR85)=0,BU85,IF(BV85<>0,BV85,MAX(BR85:BR85)))","v":27.3},{"$f":"IF(OR(BU85=\"\",BU85=0),\"\",IF(BW85>'Quadro 1'!$G$23,'Quadro 1'!$G$23,IF(BW85<'Quadro 1'!$G$10,'Quadro 1'!$G$10,MIN(BY85:BZ85))))","v":27.3},{"$f":"IF($BW85<='Quadro 1'!$G$10,'Quadro 1'!$G$10,IF($BW85<='Quadro 1'!$G$11,'Quadro 1'!$G$11,IF($BW85<='Quadro 1'!$G$12,'Quadro 1'!$G$12,IF($BW85<='Quadro 1'!$G$13,'Quadro 1'!$G$13,IF($BW85<='Quadro 1'!$G$14,'Quadro 1'!$G$14,IF($BW85<='Quadro 1'!$G$15,'Quadro 1'!$G$15,IF($BW85<='Quadro 1'!$G$16,'Quadro 1'!$G$16,\"\")))))))","v":27.3},{"$f":"IF(OR(BU85=\"\",BU85=0),\"\",IF($BW85<='Quadro 1'!$G$17,'Quadro 1'!$G$17,IF($BW85<='Quadro 1'!$G$18,'Quadro 1'!$G$18,IF($BW85<='Quadro 1'!$G$19,'Quadro 1'!$G$19,IF($BW85<='Quadro 1'!$G$20,'Quadro 1'!$G$20,IF($BW85<='Quadro 1'!$G$21,'Quadro 1'!$G$21,IF($BW85<='Quadro 1'!$G$22,'Quadro 1'!$G$22,IF($BW85<='Quadro 1'!$G$23,'Quadro 1'!$G$23,'Quadro 1'!$G$23))))))))","v":80.900000000000006},null,null,null,null,null,null,null,null,null,null,null,null,null,null,null,null,null,null,null,null,null,null,null,null,null,null,null,null,null,null,null,null,null,null,null,null,null,null,null,null,null,null,null,null,null,null,null,null,null,null,null,null,null,null,null,null,null,null,null,null,null,null,null,null,null,null,null,null,null,null,null,null,null,null,3,null,"","","","","",{"$f":"IF(FC85=\"\",\"\",1)","v":""},0,0,0,0,null,"",0,null,null,"",0,null,null,"",0,null,null,"",0,null,null,"",0,null,null,"",0,null,null,"",0,null,null,"",0,null,null,"",0,null,null,"",0,null,null,"",0,null,null,"",0,null,null,"",0,null,null,"",0,null,null,"",0,null,null,"",0,null,null,"",0,null,null,"",0,null,null,"",0,null,null,"",0,null,null,"",0,null,null,"",0,null,null,"",0,null,null,"",0]
[null,null,null,null,null,null,null,null,null,null,null,null,null,null,null,null,null,null,null,null,null,null,null,null,null,null,null,null,null,null,null,null,null,null,null,null,null,null,null,null,null,null,null,null,null,{"$f":"IF($EW$23=\"\",\"\",LOOKUP($EW$23,$EU$25:$EU$49,DU$25:DU$49))","v":""},{"$f":"IF($N$21+1<=$AU$84,$N$21+1,\"\")","v":2},{"$f":"IF(AW86=\"\",\"\",AW86+AV85)","v":120},{"$f":"IF(OR(BN85=\"\",AU86=\"\"),\"\",$B$17*$P$11*SQRT(BN85*(1/100)*(1/$B$18)))","v":60},null,{"$f":"IF(OR($AZ$84=\"\",AZ86=\"\"),\"\",AY85-1)","v":-1},{"$f":"IFERROR(IF(OR(AU86=\"\",AW86=\"\"),\"\",LARGE($AW$85:$AW$93,AU86)),\"\")","v":60},{"$f":"IF(OR(AY86=\"\",AY86<1),\"\",AZ86)","v":""},2,{"$f":"IF($FB$53=\"\",\"\",IF($AZ$84=0,\"\",IF(AND(BB86<=$AX$79,$AJ$6=\"x\"),AW86,IF(BB86<=$AX$79,AZ86,\"\"))))","v":""},{"$f":"IF(BB86>$AU$7,\"\",IF(AU86<>\"\",AU86,IF(AND(BB85=$AU$84,$BC$84<>0),1,BD85+1)))","v":2},60,{"$f":"IF(BE86=\"\",\"\",BF85+BE86)","v":120},{"$f":"IF(BF86=\"\",\"\",BF86/$BE$84)","v":1},{"$f":"IF(OR(AT86=\"\",AU86=\"\"),\"\",MATCH(AT86,$G$25:$G$49,0))","v":""},{"$f":"IF(OR(AT86=\"\",AU86=\"\"),0,LOOKUP($BH86,$EU$25:$EU$49,$M$25:$M$49))","v":0},{"$f":"IF(OR(AT86=\"\",AU86=\"\"),0,LOOKUP($BH86,$EU$25:$EU$49,$K$25:$K$49))","v":0},"","","","",56.25,{"$f":"IF(BN85=\"\",\"\",BN85)","v":56.25},"",{"$f":"IF(OR(AT86=\"\",AU86=\"\"),0,IF($A$5=8,LOOKUP($BH86,$EU$25:$EU$49,$CT$25:$CT$49),LOOKUP($BH86,$EU$25:$EU$49,$CW$25:$CW$49)))","v":0},{"$f":"IF(OR(AT86=\"\",AU86=\"\"),0,IF($A$5=9,LOOKUP($BH86,$EU$25:$EU$49,$CU$25:$CU$49),LOOKUP($BH86,$EU$25:$EU$49,$CX$25:$CX$49)))","v":0},{"$f":"IF(OR(AT86=\"\",AU86=\"\"),0,IF($A$5=10,LOOKUP($BH86,$EU$25:$EU$49,$CV$25:$CV$49),LOOKUP($BH86,$EU$25:$EU$49,$CY$25:$CY$49)))","v":0},{"$f":"IF(OR(AV86=\"\",FD20=\"\"),\"\",IF($M$15=\"\",ROUND((61.7*100000*((AV86/$B$17)^1.85/($P$16^1.85*$FD$20)))^(1/4.87),1),ROUND(((4^11*$P$16^4*((AV86/$B$17/60)*0.001)^7)/(PI()^7*$FD$20^4))^(1/19)*1000,1)))","v":""},{"$f":"IF(OR(AT86=\"\",AU86=\"\"),0,LOOKUP($BH86,$EU$25:$EU$49,$U$25:$U$49))","v":0},{"$f":"IF(MAX(BR86:BT86)=0,BU86,IF(BV86<>0,BV86,MAX(BR86:BT86)))","v":""},{"$f":"IF(OR(BU86=\"\",BU86=0),\"\",IF(BW86>'Quadro 1'!$G$23,'Quadro 1'!$G$23,IF(BW86<'Quadro 1'!$G$10,'Quadro 1'!$G$10,MIN(BY86:BZ86))))","v":""},{"$f":"IF($BW86<='Quadro 1'!$G$10,'Quadro 1'!$G$10,IF($BW86<='Quadro 1'!$G$11,'Quadro 1'!$G$11,IF($BW86<='Quadro 1'!$G$12,'Quadro 1'!$G$12,IF($BW86<='Quadro 1'!$G$13,'Quadro 1'!$G$13,IF($BW86<='Quadro 1'!$G$14,'Quadro 1'!$G$14,IF($BW86<='Quadro 1'!$G$15,'Quadro 1'!$G$15,IF($BW86<='Quadro 1'!$G$16,'Quadro 1'!$G$16,\"\")))))))","v":""},{"$f":"IF(OR(BU86=\"\",BU86=0),\"\",IF($BW86<='Quadro 1'!$G$17,'Quadro 1'!$G$17,IF($BW86<='Quadro 1'!$G$18,'Quadro 1'!$G$18,IF($BW86<='Quadro 1'!$G$19,'Quadro 1'!$G$19,IF($BW86<='Quadro 1'!$G$20,'Quadro 1'!$G$20,IF($BW86<='Quadro 1'!$G$21,'Quadro 1'!$G$21,IF($BW86<='Quadro 1'!$G$22,'Quadro 1'!$G$22,IF($BW86<='Quadro 1'!$G$23,'Quadro 1'!$G$23,'Quadro 1'!$G$23))))))))","v":""},null,null,null,null,null,null,null,null,null,null,null,null,null,null,null,null,null,null,null,null,null,null,null,null,null,null,null,null,null,null,null,null,null,null,null,null,null,null,null,null,null,null,null,null,null,null,null,null,null,null,null,null,null,null,null,null,null,null,null,null,null,null,null,null,null,null,null,null,null,null,null,null,null,null,4,null,"","","","","","",0,0,0,0,null,"",0,null,null,"",0,null,null,"",0,null,null,"",0,null,null,"",0,null,null,"",0,null,null,"",0,null,null,"",0,null,null,"",0,null,null,"",0,null,null,"",0,null,null,"",0,null,null,"",0,null,null,"",0,null,null,"",0,null,null,"",0,null,null,"",0,null,null,"",0,null,null,"",0,null,null,"",0,null,null,"",0,null,null,"",0,null,null,"",0,null,null,"",0]
[null,null,null,null,null,null,null,null,null,null,null,null,null,null,null,null,null,null,null,null,null,null,null,null,null,null,null,null,null,null,null,null,null,null,null,null,null,null,null,null,null,null,null,null,null,{"$f":"IF($EW$23=\"\",\"\",LOOKUP($EW$23,$EU$25:$EU$49,DV$25:DV$49))","v":""},{"$f":"IF($N$21+2<=$AU$84,$N$21+2,\"\")","v":3},{"$f":"IF(AW87=\"\",\"\",AW87+AV86)","v":""},"",null,{"$f":"IF(OR($AZ$84=\"\",AZ87=\"\"),\"\",AY86-1)","v":""},"","",3,"",3,"",{"$f":"IF(BE87=\"\",\"\",BF86+BE87)","v":""},"",{"$f":"IF(OR(AT87=\"\",AU87=\"\"),\"\",MATCH(AT87,$G$25:$G$49,0))","v":""},0,0,"","","","","","","",0,0,0,{"$f":"IF(AV87=\"\",\"\",IF($M$15=\"\",ROUND((61.7*100000*((AV87/$B$17)^1.85/($P$16^1.85*$FD$20)))^(1/4.87),1),ROUND(((4^11*$P$16^4*((AV87/$B$17/60)*0.001)^7)/(PI()^7*$FD$20^4))^(1/19)*1000,1)))","v":""},0,"",{"$f":"IF(OR(BU87=\"\",BU87=0),\"\",IF(BW87>'Quadro 1'!$G$23,'Quadro 1'!$G$23,IF(BW87<'Quadro 1'!$G$10,'Quadro 1'!$G$10,MIN(BY87:BZ87))))","v":""},{"$f":"IF($BW87<='Quadro 1'!$G$10,'Quadro 1'!$G$10,IF($BW87<='Quadro 1'!$G$11,'Quadro 1'!$G$11,IF($BW87<='Quadro 1'!$G$12,'Quadro 1'!$G$12,IF($BW87<='Quadro 1'!$G$13,'Quadro 1'!$G$13,IF($BW87<='Quadro 1'!$G$14,'Quadro 1'!$G$14,IF($BW87<='Quadro 1'!$G$15,'Quadro 1'!$G$15,IF($BW87<='Quadro 1'!$G$16,'Quadro 1'!$G$16,\"\")))))))","v":""},{"$f":"IF(OR(BU87=\"\",BU87=0),\"\",IF($BW87<='Quadro 1'!$G$17,'Quadro 1'!$G$17,IF($BW87<='Quadro 1'!$G$18,'Quadro 1'!$G$18,IF($BW87<='Quadro 1'!$G$19,'Quadro 1'!$G$19,IF($BW87<='Quadro 1'!$G$20,'Quadro 1'!$G$20,IF($BW87<='Quadro 1'!$G$21,'Quadro 1'!$G$21,IF($BW87<='Quadro 1'!$G$22,'Quadro 1'!$G$22,IF($BW87<='Quadro 1'!$G$23,'Quadro 1'!$G$23,'Quadro 1'!$G$23))))))))","v":""},null,null,null,null,null,null,null,null,null,null,null,null,null,null,null,null,null,null,null,null,null,null,null,null,null,null,null,null,null,null,null,null,null,null,null,null,null,null,null,null,null,null,null,null,null,null,null,null,null,null,null,null,null,null,null,null,null,null,null,null,null,null,null,null,null,null,null,null,null,null,null,null,null,null,5,null,"","","","","","",0,0,0,0,null,"",0,null,null,"",0,null,null,"",0,null,null,"",0,null,null,"",0,null,null,"",0,null,null,"",0,null,null,"",0,null,null,"",0,null,null,"",0,null,null,"",0,null,null,"",0,null,null,"",0,null,null,"",0,null,null,"",0,null,null,"",0,null,null,"",0,null,null,"",0,null,null,"",0,null,null,"",0,null,null,"",0,null,null,"",0,null,null,"",0,null,null,"",0]
[null,null,null,null,null,null,null,null,null,null,null,null,null,null,null,null,null,null,null,null,null,null,null,null,null,null,null,null,null,null,null,null,null,null,null,null,null,null,null,null,null,null,null,null,null,{"$f":"IF($EW$23=\"\",\"\",LOOKUP($EW$23,$EU$25:$EU$49,DW$25:DW$49))","v":""},{"$f":"IF($N$21+3<=$AU$84,$N$21+3,\"\")","v":4},"","",null,{"$f":"IF(OR($AZ$84=\"\",AZ88=\"\"),\"\",AY87-1)","v":""},"","",4,"",4,"","","",{"$f":"IF(OR(AT88=\"\",AU88=\"\"),\"\",MATCH(AT88,$G$25:$G$49,0))","v":""},0,0,"","","","","","","",0,0,0,"",0,"",{"$f":"IF(OR(BU88=\"\",BU88=0),\"\",IF(BW88>'Quadro 1'!$G$23,'Quadro 1'!$G$23,IF(BW88<'Quadro 1'!$G$10,'Quadro 1'!$G$10,MIN(BY88:BZ88))))","v":""},{"$f":"IF($BW88<='Quadro 1'!$G$10,'Quadro 1'!$G$10,IF($BW88<='Quadro 1'!$G$11,'Quadro 1'!$G$11,IF($BW88<='Quadro 1'!$G$12,'Quadro 1'!$G$12,IF($BW88<='Quadro 1'!$G$13,'Quadro 1'!$G$13,IF($BW88<='Quadro 1'!$G$14,'Quadro 1'!$G$14,IF($BW88<='Quadro 1'!$G$15,'Quadro 1'!$G$15,IF($BW88<='Quadro 1'!$G$16,'Quadro 1'!$G$16,\"\")))))))","v":""},{"$f":"IF(OR(BU88=\"\",BU88=0),\"\",IF($BW88<='Quadro 1'!$G$17,'Quadro 1'!$G$17,IF($BW88<='Quadro 1'!$G$18,'Quadro 1'!$G$18,IF($BW88<='Quadro 1'!$G$19,'Quadro 1'!$G$19,IF($BW88<='Quadro 1'!$G$20,'Quadro 1'!$G$20,IF($BW88<='Quadro 1'!$G$21,'Quadro 1'!$G$21,IF($BW88<='Quadro 1'!$G$22,'Quadro 1'!$G$22,IF($BW88<='Quadro 1'!$G$23,'Quadro 1'!$G$23,'Quadro 1'!$G$23))))))))","v":""},null,null,null,null,null,null,null,null,null,null,null,null,null,null,null,null,null,null,null,null,null,null,null,null,null,null,null,null,null,null,null,null,null,null,null,null,null,null,null,null,null,null,null,null,null,null,null,null,null,null,null,null,null,null,null,null,null,null,null,null,null,null,null,null,null,null,null,null,null,null,null,null,null,null,6,null,"","","","","","",0,0,0,0,null,"",0,null,null,"",0,null,null,"",0,null,null,"",0,null,null,"",0,null,null,"",0,null,null,"",0,null,null,"",0,null,null,"",0,null,null,"",0,null,null,"",0,null,null,"",0,null,null,"",0,null,null,"",0,null,null,"",0,null,null,"",0,null,null,"",0,null,null,"",0,null,null,"",0,null,null,"",0,null,null,"",0,null,null,"",0,null,null,"",0,null,null,"",0]
[null,null,null,null,null,null,null,null,null,null,null,null,null,null,null,null,null,null,null,null,null,null,null,null,null,null,null,null,null,null,null,null,null,null,null,null,null,null,null,null,null,null,null,null,null,{"$f":"IF($EW$23=\"\",\"\",LOOKUP($EW$23,$EU$25:$EU$49,DX$25:DX$49))","v":""},{"$f":"IF($N$21+4<=$AU$84,$N$21+4,\"\")","v":""},"","",null,"","","",5,"","","","","","",0,0,"","","","","","","",0,0,0,"",0,"",{"$f":"IF(OR(BU89=\"\",BU89=0),\"\",IF(BW89>'Quadro 1'!$G$23,'Quadro 1'!$G$23,IF(BW89<'Quadro 1'!$G$10,'Quadro 1'!$G$10,MIN(BY89:BZ89))))","v":""},{"$f":"IF($BW89<='Quadro 1'!$G$10,'Quadro 1'!$G$10,IF($BW89<='Quadro 1'!$G$11,'Quadro 1'!$G$11,IF($BW89<='Quadro 1'!$G$12,'Quadro 1'!$G$12,IF($BW89<='Quadro 1'!$G$13,'Quadro 1'!$G$13,IF($BW89<='Quadro 1'!$G$14,'Quadro 1'!$G$14,IF($BW89<='Quadro 1'!$G$15,'Quadro 1'!$G$15,IF($BW89<='Quadro 1'!$G$16,'Quadro 1'!$G$16,\"\")))))))","v":""},{"$f":"IF(OR(BU89=\"\",BU89=0),\"\",IF($BW89<='Quadro 1'!$G$17,'Quadro 1'!$G$17,IF($BW89<='Quadro 1'!$G$18,'Quadro 1'!$G$18,IF($BW89<='Quadro 1'!$G$19,'Quadro 1'!$G$19,IF($BW89<='Quadro 1'!$G$20,'Quadro 1'!$G$20,IF($BW89<='Quadro 1'!$G$21,'Quadro 1'!$G$21,IF($BW89<='Quadro 1'!$G$22,'Quadro 1'!$G$22,IF($BW89<='Quadro 1'!$G$23,'Quadro 1'!$G$23,'Quadro 1'!$G$23))))))))","v":""},null,null,null,null,null,null,null,null,null,null,null,null,null,null,null,null,null,null,null,null,null,null,null,null,null,null,null,null,null,null,null,null,null,null,null,null,null,null,null,null,null,null,null,null,null,null,null,null,null,null,null,null,null,null,null,null,null,null,null,null,null,null,null,null,null,null,null,null,null,null,null,null,null,null,7,null,"","","","","","",0,0,0,0,null,"",0,null,null,"",0,null,null,"",0,null,null,"",0,null,null,"",0,null,null,"",0,null,null,"",0,null,null,"",0,null,null,"",0,null,null,"",0,null,null,"",0,null,null,"",0,null,null,"",0,null,null,"",0,null,null,"",0,null,null,"",0,null,null,"",0,null,null,"",0,null,null,"",0,null,null,"",0,null,null,"",0,null,null,"",0,null,null,"",0,null,null,"",0]
[null,null,null,null,null,null,null,null,null,null,null,null,null,null,null,null,null,null,null,null,null,null,null,null,null,null,null,null,null,null,null,null,null,null,null,null,null,null,null,null,null,null,null,null,null,{"$f":"IF($EW$23=\"\",\"\",LOOKUP($EW$23,$EU$25:$EU$49,DY$25:DY$49))","v":""},{"$f":"IF($N$21+5<=$AU$84,$N$21+5,\"\")","v":""},"","",null,"","","",6,"","","","","","",0,0,"","","","","","","",0,0,0,"",0,"",{"$f":"IF(OR(BU90=\"\",BU90=0),\"\",IF(BW90>'Quadro 1'!$G$23,'Quadro 1'!$G$23,IF(BW90<'Quadro 1'!$G$10,'Quadro 1'!$G$10,MIN(BY90:BZ90))))","v":""},{"$f":"IF($BW90<='Quadro 1'!$G$10,'Quadro 1'!$G$10,IF($BW90<='Quadro 1'!$G$11,'Quadro 1'!$G$11,IF($BW90<='Quadro 1'!$G$12,'Quadro 1'!$G$12,IF($BW90<='Quadro 1'!$G$13,'Quadro 1'!$G$13,IF($BW90<='Quadro 1'!$G$14,'Quadro 1'!$G$14,IF($BW90<='Quadro 1'!$G$15,'Quadro 1'!$G$15,IF($BW90<='Quadro 1'!$G$16,'Quadro 1'!$G$16,\"\")))))))","v":""},{"$f":"IF(OR(BU90=\"\",BU90=0),\"\",IF($BW90<='Quadro 1'!$G$17,'Quadro 1'!$G$17,IF($BW90<='Quadro 1'!$G$18,'Quadro 1'!$G$18,IF($BW90<='Quadro 1'!$G$19,'Quadro 1'!$G$19,IF($BW90<='Quadro 1'!$G$20,'Quadro 1'!$G$20,IF($BW90<='Quadro 1'!$G$21,'Quadro 1'!$G$21,IF($BW90<='Quadro 1'!$G$22,'Quadro 1'!$G$22,IF($BW90<='Quadro 1'!$G$23,'Quadro 1'!$G$23,'Quadro 1'!$G$23))))))))","v":""},null,null,null,null,null,null,null,null,null,null,null,null,null,null,null,null,null,null,null,null,null,null,null,null,null,null,null,null,null,null,null,null,null,null,null,null,null,null,null,null,null,null,null,null,null,null,null,null,null,null,null,null,null,null,null,null,null,null,null,null,null,null,null,null,null,null,null,null,null,null,null,null,null,null,8,null,null,null,null,null,"","",0,0,0,0,null,"",0,null,null,"",0,null,null,"",0,null,null,"",0,null,null,"",0,null,null,"",0,null,null,"",0,null,null,"",0,null,null,"",0,null,null,"",0,null,null,"",0,null,null,"",0,null,null,"",0,null,null,"",0,null,null,"",0,null,null,"",0,null,null,"",0,null,null,"",0,null,null,"",0,null,null,"",0,null,null,"",0,null,null,"",0,null,null,"",0,null,null,"",0]
[null,null,null,null,null,null,null,null,null,null,null,null,null,null,null,null,null,null,null,null,null,null,null,null,null,null,null,null,null,null,null,null,null,null,null,null,null,null,null,null,null,null,null,null,null,{"$f":"IF($EW$23=\"\",\"\",LOOKUP($EW$23,$EU$25:$EU$49,DZ$25:DZ$49))","v":""},{"$f":"IF($N$21+6<=$AU$84,$N$21+6,\"\")","v":""},"","",null,"","","",7,"","",{"$f":"IF(BD91=\"\",\"\",LOOKUP(BD91,$BB$85:$BB$93,$AZ$85:$AZ$93))","v":""},"","","",0,0,"","","","","","","",0,0,0,"",0,"",{"$f":"IF(OR(BU91=\"\",BU91=0),\"\",IF(BW91>'Quadro 1'!$G$23,'Quadro 1'!$G$23,IF(BW91<'Quadro 1'!$G$10,'Quadro 1'!$G$10,MIN(BY91:BZ91))))","v":""},{"$f":"IF($BW91<='Quadro 1'!$G$10,'Quadro 1'!$G$10,IF($BW91<='Quadro 1'!$G$11,'Quadro 1'!$G$11,IF($BW91<='Quadro 1'!$G$12,'Quadro 1'!$G$12,IF($BW91<='Quadro 1'!$G$13,'Quadro 1'!$G$13,IF($BW91<='Quadro 1'!$G$14,'Quadro 1'!$G$14,IF($BW91<='Quadro 1'!$G$15,'Quadro 1'!$G$15,IF($BW91<='Quadro 1'!$G$16,'Quadro 1'!$G$16,\"\")))))))","v":""},{"$f":"IF(OR(BU91=\"\",BU91=0),\"\",IF($BW91<='Quadro 1'!$G$17,'Quadro 1'!$G$17,IF($BW91<='Quadro 1'!$G$18,'Quadro 1'!$G$18,IF($BW91<='Quadro 1'!$G$19,'Quadro 1'!$G$19,IF($BW91<='Quadro 1'!$G$20,'Quadro 1'!$G$20,IF($BW91<='Quadro 1'!$G$21,'Quadro 1'!$G$21,IF($BW91<='Quadro 1'!$G$22,'Quadro 1'!$G$22,IF($BW91<='Quadro 1'!$G$23,'Quadro 1'!$G$23,'Quadro 1'!$G$23))))))))","v":""},null,null,null,null,null,null,null,null,null,null,null,null,null,null,null,null,null,null,null,null,null,null,null,null,null,null,null,null,null,null,null,null,null,null,null,null,null,null,null,null,null,null,null,null,null,null,null,null,null,null,null,null,null,null,null,null,null,null,null,null,null,null,null,null,null,null,null,null,null,null,null,null,null,null,9,null,null,null,null,null,"","",0,0,0,0,null,"",0,null,null,"",0,null,null,"",0,null,null,"",0,null,null,"",0,null,null,"",0,null,null,"",0,null,null,"",0,null,null,"",0,null,null,"",0,null,null,"",0,null,null,"",0,null,null,"",0,null,null,"",0,null,null,"",0,null,null,"",0,null,null,"",0,null,null,"",0,null,null,"",0,null,null,"",0,null,null,"",0,null,null,"",0,null,null,"",0,null,null,"",0]
[null,null,null,null,null,null,null,null,null,null,null,null,null,null,null,null,null,null,null,null,null,null,null,null,null,null,null,null,null,null,null,null,null,null,null,null,null,null,null,null,null,null,null,null,null,{"$f":"IF($EW$23=\"\",\"\",LOOKUP($EW$23,$EU$25:$EU$49,EA$25:EA$49))","v":""},{"$f":"IF($N$21+7<=$AU$84,$N$21+7,\"\")","v":""},"","",null,"","","",8,"","","","","","",0,0,"","","","","","","",0,0,0,"",0,"",{"$f":"IF(OR(BU92=\"\",BU92=0),\"\",IF(BW92>'Quadro 1'!$G$23,'Quadro 1'!$G$23,IF(BW92<'Quadro 1'!$G$10,'Quadro 1'!$G$10,MIN(BY92:BZ92))))","v":""},{"$f":"IF($BW92<='Quadro 1'!$G$10,'Quadro 1'!$G$10,IF($BW92<='Quadro 1'!$G$11,'Quadro 1'!$G$11,IF($BW92<='Quadro 1'!$G$12,'Quadro 1'!$G$12,IF($BW92<='Quadro 1'!$G$13,'Quadro 1'!$G$13,IF($BW92<='Quadro 1'!$G$14,'Quadro 1'!$G$14,IF($BW92<='Quadro 1'!$G$15,'Quadro 1'!$G$15,IF($BW92<='Quadro 1'!$G$16,'Quadro 1'!$G$16,\"\")))))))","v":""},{"$f":"IF(OR(BU92=\"\",BU92=0),\"\",IF($BW92<='Quadro 1'!$G$17,'Quadro 1'!$G$17,IF($BW92<='Quadro 1'!$G$18,'Quadro 1'!$G$18,IF($BW92<='Quadro 1'!$G$19,'Quadro 1'!$G$19,IF($BW92<='Quadro 1'!$G$20,'Quadro 1'!$G$20,IF($BW92<='Quadro 1'!$G$21,'Quadro 1'!$G$21,IF($BW92<='Quadro 1'!$G$22,'Quadro 1'!$G$22,IF($BW92<='Quadro 1'!$G$23,'Quadro 1'!$G$23,'Quadro 1'!$G$23))))))))","v":""},null,null,null,null,null,null,null,null,null,null,null,null,null,null,null,null,null,null,null,null,null,null,null,null,null,null,null,null,null,null,null,null,null,null,null,null,null,null,null,null,null,null,null,null,null,null,null,null,null,null,null,null,null,null,null,null,null,null,null,null,null,null,null,null,null,null,null,null,null,null,null,null,null,null,10,null,null,null,null,null,"","",0,0,0,0,null,"",0,null,null,"",0,null,null,"",0,null,null,"",0,null,null,"",0,null,null,"",0,null,null,"",0,null,null,"",0,null,null,"",0,null,null,"",0,null,null,"",0,null,null,"",0,null,null,"",0,null,null,"",0,null,null,"",0,null,null,"",0,null,null,"",0,null,null,"",0,null,null,"",0,null,null,"",0,null,null,"",0,null,null,"",0,null,null,"",0,null,null,"",0]
[null,null,null,null,null,null,null,null,null,null,null,null,null,null,null,null,null,null,null,null,null,null,null,null,null,null,null,null,null,null,null,null,null,null,null,null,null,null,null,null,null,null,null,null,null,{"$f":"IF($EW$23=\"\",\"\",LOOKUP($EW$23,$EU$25:$EU$49,EB$25:EB$49))","v":""},{"$f":"IF($N$21+8<=$AU$84,$N$21+8,\"\")","v":""},"","",null,"",{"$f":"IFERROR(IF(OR(AU93=\"\",AW93=\"\"),\"\",LARGE($AW$85:$AW$93,AU93)),\"\")","v":""},"",9,"","","","","","",0,0,"","","","","","","",0,0,0,"",0,"",{"$f":"IF(OR(BU93=\"\",BU93=0),\"\",IF(BW93>'Quadro 1'!$G$23,'Quadro 1'!$G$23,IF(BW93<'Quadro 1'!$G$10,'Quadro 1'!$G$10,MIN(BY93:BZ93))))","v":""},{"$f":"IF($BW93<='Quadro 1'!$G$10,'Quadro 1'!$G$10,IF($BW93<='Quadro 1'!$G$11,'Quadro 1'!$G$11,IF($BW93<='Quadro 1'!$G$12,'Quadro 1'!$G$12,IF($BW93<='Quadro 1'!$G$13,'Quadro 1'!$G$13,IF($BW93<='Quadro 1'!$G$14,'Quadro 1'!$G$14,IF($BW93<='Quadro 1'!$G$15,'Quadro 1'!$G$15,IF($BW93<='Quadro 1'!$G$16,'Quadro 1'!$G$16,\"\")))))))","v":""},{"$f":"IF(OR(BU93=\"\",BU93=0),\"\",IF($BW93<='Quadro 1'!$G$17,'Quadro 1'!$G$17,IF($BW93<='Quadro 1'!$G$18,'Quadro 1'!$G$18,IF($BW93<='Quadro 1'!$G$19,'Quadro 1'!$G$19,IF($BW93<='Quadro 1'!$G$20,'Quadro 1'!$G$20,IF($BW93<='Quadro 1'!$G$21,'Quadro 1'!$G$21,IF($BW93<='Quadro 1'!$G$22,'Quadro 1'!$G$22,IF($BW93<='Quadro 1'!$G$23,'Quadro 1'!$G$23,'Quadro 1'!$G$23))))))))","v":""},null,null,null,null,null,null,null,null,null,null,null,null,null,null,null,null,null,null,null,null,null,null,null,null,null,null,null,null,null,null,null,null,null,null,null,null,null,null,null,null,null,null,null,null,null,null,null,null,null,null,null,null,null,null,null,null,null,null,null,null,null,null,null,null,null,null,null,null,null,null,null,null,null,null,11,null,null,null,null,null,"","",0,0,0,0,null,"",0,null,null,"",0,null,null,"",0,null,null,"",0,null,null,"",0,null,null,"",0,null,null,"",0,null,null,"",0,null,null,"",0,null,null,"",0,null,null,"",0,null,null,"",0,null,null,"",0,null,null,"",0,null,null,"",0,null,null,"",0,null,null,"",0,null,null,"",0,null,null,"",0,null,null,"",0,null,null,"",0,null,null,"",0,null,null,"",0,null,null,"",0]
[null,null,null,null,null,null,null,null,null,null,null,null,null,null,null,null,null,null,null,null,null,null,null,null,null,null,null,null,null,null,null,null,null,null,null,null,null,null,null,null,null,null,null,null,null,null,null,null,null,null,null,null,null,null,null,null,null,null,null,null,null,null,null,null,null,null,null,null,null,null,null,null,"",null,null,null,null,null,null,null,null,null,null,null,null,null,null,null,null,null,null,null,null,null,null,null,null,null,null,null,null,null,null,null,null,null,null,null,null,null,null,null,null,null,null,null,null,null,null,null,null,null,null,null,null,null,null,null,null,null,null,null,null,null,null,null,null,null,null,null,null,null,null,null,null,null,null,null,null,null,null,null,12,null,null,null,null,null,"",{"$f":"IF(FC94=\"\",\"\",1)","v":""},0,0,0,0,null,"",0,null,null,"",0,null,null,"",0,null,null,"",0,null,null,"",0,null,null,"",0,null,null,"",0,null,null,"",0,null,null,"",0,null,null,"",0,null,null,"",0,null,null,"",0,null,null,"",0,null,null,"",0,null,null,"",0,null,null,"",0,null,null,"",0,null,null,"",0,null,null,"",0,null,null,"",0,null,null,"",0,null,null,"",0,null,null,"",0,null,null,"",0]
[null,null,null,null,null,null,null,null,null,null,null,null,null,null,null,null,null,null,null,null,null,null,null,null,null,null,null,null,null,null,null,null,null,null,null,null,null,null,null,null,null,null,null,null,null,null,null,null,null,null,null,null,null,null,null,null,null,null,null,null,null,null,null,null,null,null,null,null,null,null,null,null,null,null,null,null,null,null,null,null,null,null,null,null,null,null,null,null,null,null,null,null,null,null,null,null,null,null,null,null,null,null,null,null,null,null,null,null,null,null,null,null,null,null,null,null,null,null,null,null,null,null,null,null,null,null,null,null,null,null,null,null,null,null,null,null,null,null,null,null,null,null,null,null,null,null,null,null,null,null,null,null,13,null,null,null,null,null,"","",0,0,0,0,null,"",0,null,null,"",0,null,null,"",0,null,null,"",0,null,null,"",0,null,null,"",0,null,null,"",0,null,null,"",0,null,null,"",0,null,null,"",0,null,null,"",0,null,null,"",0,null,null,"",0,null,null,"",0,null,null,"",0,null,null,"",0,null,null,"",0,null,null,"",0,null,null,"",0,null,null,"",0,null,null,"",0,null,null,"",0,null,null,"",0,null,null,"",0]
[null,null,null,null,null,null,null,null,null,null,null,null,null,null,null,null,null,null,null,null,null,null,null,null,null,null,null,null,null,null,null,null,null,null,null,null,null,null,null,null,null,null,null,null,null,null,null,null,null,null,null,null,null,null,null,null,null,null,null,null,null,null,null,null,null,null,null,null,null,null,null,null,null,null,null,null,null,null,null,null,null,null,null,null,null,null,null,null,null,null,null,null,null,null,null,null,null,null,null,null,null,null,null,null,null,null,null,null,null,null,null,null,null,null,null,null,null,null,null,null,null,null,null,null,null,null,null,null,null,null,null,null,null,null,null,null,null,null,null,null,null,null,null,null,null,null,null,null,null,null,null,null,14,null,null,null,null,null,"","",0,0,0,0,null,"",0,null,null,"",0,null,null,"",0,null,null,"",0,null,null,"",0,null,null,"",0,null,null,"",0,null,null,"",0,null,null,"",0,null,null,"",0,null,null,"",0,null,null,"",0,null,null,"",0,null,null,"",0,null,null,"",0,null,null,"",0,null,null,"",0,null,null,"",0,null,null,"",0,null,null,"",0,null,null,"",0,null,null,"",0,null,null,"",0,null,null,"",0]
[null,null,null,null,null,null,null,null,null,null,null,null,null,null,null,null,null,null,null,null,null,null,null,null,null,null,null,null,null,null,null,null,null,null,null,null,null,null,null,null,null,null,null,null,null,"Caudais referentes aos Sub-Ramais 2,3, etc de troços não críticos",null,null,null,null,null,null,null,null,null,null,null,null,null,null,null,null,null,null,null,null,null,null,null,null,null,null,null,null,null,null,null,null,null,null,null,null,null,null,null,null,null,null,null,null,null,null,null,null,null,null,null,null,null,null,null,null,null,null,null,null,null,null,null,null,null,null,null,null,null,null,null,null,null,null,null,null,null,null,null,null,null,null,null,null,null,null,null,null,null,null,null,null,null,null,null,null,null,null,null,null,null,null,null,null,null,null,15,null,null,null,null,null,"","",0,0,0,0,null,"",0,null,null,"",0,null,null,"",0,null,null,"",0,null,null,"",0,null,null,"",0,null,null,"",0,null,null,"",0,null,null,"",0,null,null,"",0,null,null,"",0,null,null,"",0,null,null,"",0,null,null,"",0,null,null,"",0,null,null,"",0,null,null,"",0,null,null,"",0,null,null,"",0,null,null,"",0,null,null,"",0,null,null,"",0,null,null,"",0,null,null,"",0]
[null,null,null,null,null,null,null,null,null,null,null,null,null,null,null,null,null,null,null,null,null,null,null,null,null,null,null,null,null,null,null,null,null,null,null,null,null,null,null,null,null,null,null,null,null,null,null,null,null,null,"Caudais e Pressões nas bifurcações",null,null,null,null,null,null,null,null,null,null,null,null,null,null,null,null,null,null,null,null,null,null,null,null,null,null,null,null,null,null,null,null,null,null,null,null,null,null,null,null,null,null,null,null,null,null,null,null,null,null,null,null,null,null,null,null,null,null,null,null,null,null,null,null,null,null,null,null,null,null,null,null,null,null,null,null,null,null,null,null,null,null,null,null,null,null,null,null,null,null,null,null,null,null,null,null,null,null,null,null,null,16,null,null,null,null,null,"","",0,0,0,0,null,"",0,null,null,"",0,null,null,"",0,null,null,"",0,null,null,"",0,null,null,"",0,null,null,"",0,null,null,"",0,null,null,"",0,null,null,"",0,null,null,"",0,null,null,"",0,null,null,"",0,null,null,"",0,null,null,"",0,null,null,"",0,null,null,"",0,null,null,"",0,null,null,"",0,null,null,"",0,null,null,"",0,null,null,"",0,null,null,"",0,null,null,"",0]
[null,null,null,null,null,null,null,null,null,null,null,null,null,null,null,null,null,null,null,null,null,null,null,null,null,null,null,null,null,null,null,null,null,null,null,null,null,null,null,null,null,null,null,null,null,null,null,null,"Pi",null,"Qsub-ramal","K",null,null,null,null,null,null,null,null,null,null,null,null,null,null,null,null,null,null,null,null,null,null,null,null,null,null,null,null,null,null,null,null,null,null,null,null,null,null,null,null,null,null,null,null,null,null,null,null,null,null,null,null,null,null,null,null,null,null,null,null,null,null,null,null,null,null,null,null,null,null,null,null,null,null,null,null,null,null,null,null,null,null,null,null,null,null,null,null,null,null,null,null,null,null,null,null,null,null,null,null,17,null,null,null,null,null,"","",0,0,0,0,null,"",0,null,null,"",0,null,null,"",0,null,null,"",0,null,null,"",0,null,null,"",0,null,null,"",0,null,null,"",0,null,null,"",0,null,null,"",0,null,null,"",0,null,null,"",0,null,null,"",0,null,null,"",0,null,null,"",0,null,null,"",0,null,null,"",0,null,null,"",0,null,null,"",0,null,null,"",0,null,null,"",0,null,null,"",0,null,null,"",0,null,null,"",0]
[null,null,null,null,null,null,null,null,null,null,null,null,null,null,null,null,null,null,null,null,null,null,null,null,null,null,null,null,null,null,null,null,null,null,null,null,null,null,null,null,null,null,null,null,null,null,null,null,{"$f":"BE24","v":"kPa"},null,{"$f":"Q24","v":"l/min"},"métrico",null,null,null,null,null,null,null,null,null,null,null,null,null,null,null,null,null,null,null,null,null,null,null,null,null,null,null,null,null,null,null,null,null,null,null,null,null,null,null,null,null,null,null,null,null,null,null,null,null,null,null,null,null,null,null,null,null,null,null,null,null,null,null,null,null,null,null,null,null,null,null,null,null,null,null,null,null,null,null,null,null,null,null,null,null,null,null,null,null,null,null,null,null,null,null,null,null,null,null,null,18,null,null,null,null,null,"","",0,0,0,0,null,"",0,null,null,"",0,null,null,"",0,null,null,"",0,null,null,"",0,null,null,"",0,null,null,"",0,null,null,"",0,null,null,"",0,null,null,"",0,null,null,"",0,null,null,"",0,null,null,"",0,null,null,"",0,null,null,"",0,null,null,"",0,null,null,"",0,null,null,"",0,null,null,"",0,null,null,"",0,null,null,"",0,null,null,"",0,null,null,"",0,null,null,"",0]
[null,null,null,null,null,null,null,null,null,null,null,null,null,null,null,null,null,null,null,null,null,null,null,null,null,null,null,null,null,null,null,null,null,null,null,null,null,null,null,null,null,null,null,null,null,null,null,null,null,null,null,{"$f":"N24","v":0},null,null,null,null,null,null,null,null,null,null,null,null,null,null,null,null,null,null,null,null,null,null,null,null,null,null,null,null,null,null,null,null,null,null,null,null,null,null,null,null,null,null,null,null,null,null,null,null,null,null,null,null,null,null,null,null,null,null,null,null,null,null,null,null,null,null,null,null,null,null,null,null,null,null,null,null,null,null,null,null,null,null,null,null,null,null,null,null,null,null,null,null,null,null,null,null,null,null,null,null,19,null,null,null,null,null,"","",0,0,0,0,null,"",0,null,null,"",0,null,null,"",0,null,null,"",0,null,null,"",0,null,null,"",0,null,null,"",0,null,null,"",0,null,null,"",0,null,null,"",0,null,null,"",0,null,null,"",0,null,null,"",0,null,null,"",0,null,null,"",0,null,null,"",0,null,null,"",0,null,null,"",0,null,null,"",0,null,null,"",0,null,null,"",0,null,null,"",0,null,null,"",0,null,null,"",0]
[null,null,null,null,null,null,null,null,null,null,null,null,null,null,null,null,null,null,null,null,null,null,null,null,null,null,null,null,null,null,null,null,null,null,null,null,null,null,null,null,null,null,null,null,null,null,{"$f":"FB80","v":""},{"$f":"IF(AU102=\"\",\"\",MATCH(AU102,$F$25:$F$49,0))","v":""},{"$f":"IF(AU102=\"\",\"\",LOOKUP(AV102,$DN$25:$DN$49,$AC$25:$AC$49))","v":""},{"$f":"IF(OR(AY102=\"\",AY102=0),\"\",AY102/$N$23)","v":""},{"$f":"IF(AW102=\"\",\"\",$B$17*$AZ$101*SQRT(AW102*(1/$B$18)*(1/100)))","v":""},{"$f":"IF($FC$53=0,\"\",1)","v":""},null,null,null,null,null,null,null,null,null,null,null,null,null,null,null,null,null,null,null,null,null,null,null,null,null,null,null,null,null,null,null,null,null,null,null,null,null,null,null,null,null,null,null,null,null,null,null,null,null,null,null,null,null,null,null,null,null,null,null,null,null,null,null,null,null,null,null,null,null,null,null,null,null,null,null,null,null,null,null,null,null,null,null,null,null,null,null,null,null,null,null,null,null,null,null,null,null,null,null,null,20,null,null,null,null,null,"","",0,0,0,0,null,"",0,null,null,"",0,null,null,"",0,null,null,"",0,null,null,"",0,null,null,"",0,null,null,"",0,null,null,"",0,null,null,"",0,null,null,"",0,null,null,"",0,null,null,"",0,null,null,"",0,null,null,"",0,null,null,"",0,null,null,"",0,null,null,"",0,null,null,"",0,null,null,"",0,null,null,"",0,null,null,"",0,null,null,"",0,null,null,"",0,null,null,"",0]
[null,null,null,null,null,null,null,null,null,null,null,null,null,null,null,null,null,null,null,null,null,null,null,null,null,null,null,null,null,null,null,null,null,null,null,null,null,null,null,null,null,null,null,null,null,{"$f":"IF(AV103=\"\",\"\",INDEX(A$25:$A$49,AV103))","v":""},"","","",{"$f":"IF(OR(AY103=\"\",AY103=0),\"\",AY103/$N$23)","v":""},{"$f":"IF(AW103=\"\",\"\",$B$17*$AZ$101*SQRT(AW103*(1/$B$18)*(1/100)))","v":""},{"$f":"IF($FC$53=0,\"\",IF(AZ102<$FC$53,AZ102+1,IF(AZ102=$FC$53,\"\",\"\")))","v":""},null,null,null,null,null,null,null,null,null,null,null,null,null,null,null,null,null,null,null,null,null,null,null,null,null,null,null,null,null,null,null,null,null,null,null,null,null,null,null,null,null,null,null,null,null,null,null,null,null,null,null,null,null,null,null,null,null,null,null,null,null,null,null,null,null,null,null,null,null,null,null,null,null,null,null,null,null,null,null,null,null,null,null,null,null,null,null,null,null,null,null,null,null,null,null,null,null,null,null,null,21,null,null,null,null,null,"","",0,{"$f":"FF45","v":0},0,0,null,"",0,null,null,"",0,null,null,"",0,null,null,"",0,null,null,"",0,null,null,"",0,null,null,"",0,null,null,"",0,null,null,"",0,null,null,"",0,null,null,"",0,null,null,"",0,null,null,"",0,null,null,"",0,null,null,"",0,null,null,"",0,null,null,"",0,null,null,"",0,null,null,"",0,null,null,"",0,null,null,"",0,null,null,"",0,null,null,"",0,null,null,"",0]
[null,null,null,null,null,null,null,null,null,null,null,null,null,null,null,null,null,null,null,null,null,null,null,null,null,null,null,null,null,null,null,null,null,null,null,null,null,null,null,null,null,null,null,null,null,{"$f":"IF(AV104=\"\",\"\",INDEX(A$25:$A$49,AV104))","v":""},"","","","","","",null,{"$f":"IF(AV104=\"\",\"\",INDEX(C$25:$C$49,AV104))","v":""},null,null,null,null,null,null,null,null,null,null,null,null,null,null,null,null,null,null,null,null,null,null,null,null,null,null,null,null,null,null,null,null,null,null,null,null,null,null,null,null,null,null,null,null,null,null,null,null,null,null,null,null,null,null,null,null,null,null,null,null,null,null,null,null,null,null,null,null,null,null,null,null,null,null,null,null,null,null,null,null,null,null,null,null,null,null,null,null,null,null,null,null,null,null,null,null,null,null,22,null,null,null,null,null,"","",0,0,0,0,null,"",0,null,null,"",0,null,null,"",0,null,null,"",0,null,null,"",0,null,null,"",0,null,null,"",0,null,null,"",0,null,null,"",0,null,null,"",0,null,null,"",0,null,null,"",0,null,null,"",0,null,null,"",0,null,null,"",0,null,null,"",0,null,null,"",0,null,null,"",0,null,null,"",0,null,null,"",0,null,null,"",0,null,null,"",0,null,null,"",0,null,null,"",0]
[null,null,null,null,null,null,null,null,null,null,null,null,null,null,null,null,null,null,null,null,null,null,null,null,null,null,null,null,null,null,null,null,null,null,null,null,null,null,null,null,null,null,null,null,null,{"$f":"IF(AV105=\"\",\"\",INDEX(A$25:$A$49,AV105))","v":""},"","","","","","",null,{"$f":"IF(AV105=\"\",\"\",INDEX(C$25:$C$49,AV105))","v":""},null,null,null,null,null,null,null,null,null,null,null,null,null,null,null,null,null,null,null,null,null,null,null,null,null,null,null,null,null,null,null,null,null,null,null,null,null,null,null,null,null,null,null,null,null,null,null,null,null,null,null,null,null,null,null,null,null,null,null,null,null,null,null,null,null,null,null,null,null,null,null,null,null,null,null,null,null,null,null,null,null,null,null,null,null,null,null,null,null,null,null,null,null,null,null,null,null,null,23,null,null,null,null,null,"","",0,0,0,0,null,"",0,null,null,"",0,null,null,"",0,null,null,"",0,null,null,"",0,null,null,"",0,null,null,"",0,null,null,"",0,null,null,"",0,null,null,"",0,null,null,"",0,null,null,"",0,null,null,"",0,null,null,"",0,null,null,"",0,null,null,"",0,null,null,"",0,null,null,"",0,null,null,"",0,null,null,"",0,null,null,"",0,null,null,"",0,null,null,"",0,null,null,"",0]
[null,null,null,null,null,null,null,null,null,null,null,null,null,null,null,null,null,null,null,null,null,null,null,null,null,null,null,null,null,null,null,null,null,null,null,null,null,null,null,null,null,null,null,null,null,{"$f":"IF(AV106=\"\",\"\",INDEX(A$25:$A$49,AV106))","v":""},"","","","","","",null,{"$f":"IF(AV106=\"\",\"\",INDEX(C$25:$C$49,AV106))","v":""},null,null,null,null,null,null,null,null,null,null,null,null,null,null,null,null,null,null,null,null,null,null,null,null,null,null,null,null,null,null,null,null,null,null,null,null,null,null,null,null,null,null,null,null,null,null,null,null,null,null,null,null,null,null,null,null,null,null,null,null,null,null,null,null,null,null,null,null,null,null,null,null,null,null,null,null,null,null,null,null,null,null,null,null,null,null,null,null,null,null,null,null,null,null,null,null,null,null,24,null,null,null,null,null,"","",0,0,0,0,null,"",0,null,null,"",0,null,null,"",0,null,null,"",0,null,null,"",0,null,null,"",0,null,null,"",0,null,null,"",0,null,null,"",0,null,null,"",0,null,null,"",0,null,null,"",0,null,null,"",0,null,null,"",0,null,null,"",0,null,null,"",0,null,null,"",0,null,null,"",0,null,null,"",0,null,null,"",0,null,null,"",0,null,null,"",0,null,null,"",0,null,null,"",0]
[null,null,null,null,null,null,null,null,null,null,null,null,null,null,null,null,null,null,null,null,null,null,null,null,null,null,null,null,null,null,null,null,null,null,null,null,null,null,null,null,null,null,null,null,null,{"$f":"IF(AV107=\"\",\"\",INDEX(A$25:$A$49,AV107))","v":""},"","","","","","",null,{"$f":"IF(AV107=\"\",\"\",INDEX(C$25:$C$49,AV107))","v":""},null,null,null,null,null,null,null,null,null,null,null,null,null,null,null,null,null,null,null,null,null,null,null,null,null,null,null,null,null,null,null,null,null,null,null,null,null,null,null,null,null,null,null,null,null,null,null,null,null,null,null,null,null,null,null,null,null,null,null,null,null,null,null,null,null,null,null,null,null,null,null,null,null,null,null,null,null,null,null,null,null,null,null,null,null,null,null,null,null,null,null,null,null,null,null,null,null,null,25,null,null,null,null,null,"","",0,0,0,0,null,"",0,null,null,"",0,null,null,"",0,null,null,"",0,null,null,"",0,null,null,"",0,null,null,"",0,null,null,"",0,null,null,"",0,null,null,"",0,null,null,"",0,null,null,"",0,null,null,"",0,null,null,"",0,null,null,"",0,null,null,"",0,null,null,"",0,null,null,"",0,null,null,"",0,null,null,"",0,null,null,"",0,null,null,"",0,null,null,"",0,null,null,"",0]
[null,null,null,null,null,null,null,null,null,null,null,null,null,null,null,null,null,null,null,null,null,null,null,null,null,null,null,null,null,null,null,null,null,null,null,null,null,null,null,null,null,null,null,null,null,{"$f":"IF(AV108=\"\",\"\",INDEX(A$25:$A$49,AV108))","v":""},"","","","","","",null,{"$f":"IF(AV108=\"\",\"\",INDEX(C$25:$C$49,AV108))","v":""},null,null,null,null,null,null,null,null,null,null,null,null,null,null,null,null,null,null,null,null,null,null,null,null,null,null,null,null,null,null,null,null,null,null,null,null,null,null,null,null,null,null,null,null,null,null,null,null,null,null,null,null,null,null,null,null,null,null,null,null,null,null,null,null,null,null,null,null,null,null,null,null,null,null,null,null,null,null,null,null,null,null,null,null,null,null,null,null,null,null,null,null,null,null,null,null,null,null,null,null,null,null,null,null,"Total:",{"$f":"SUM(FD83:FD107)","v":0},{"$f":"MAX(FE83:FE107)","v":0}]
[null,null,null,null,null,null,null,null,null,null,null,null,null,null,null,null,null,null,null,null,null,null,null,null,null,null,null,null,null,null,null,null,null,null,null,null,null,null,null,null,null,null,null,null,null,{"$f":"IF(AV109=\"\",\"\",INDEX(A$25:$A$49,AV109))","v":""},"","","","","","",null,{"$f":"IF(AV109=\"\",\"\",INDEX(C$25:$C$49,AV109))","v":""},null,null,null,null,null,null,null,null,null,null,null,null,null,null,null,null,null,null,null,null,null,null,null,null,null,null,null,null,null,null,null,null,null,null,null,null,null,null,null,null,null,null,null,null,null,null,null,null,null,null,null,null,null,null,null,null,null,null,null,null,null,null,null,null,null,null,null,null,null,null,null,null,null,null,null,null,null,null,null,null,null,null,null,null,null,null,null,null,null,null,null,null,null,null,null,null,null,null,null,null,null,null,null,null,null,"Avaliação das perdas de carga dinâmicas acumuladas",null,null,{"$f":"FG22","v":1},null,{"$f":"FG109+1","v":2},null,null,{"$f":"FI109+1","v":3},null,null,null,{"$f":"FL109+1","v":4},null,null,null,{"$f":"FP109+1","v":5},null,null,null,{"$f":"FT109+1","v":6},null,null,null,{"$f":"FX109+1","v":7},null,null,null,{"$f":"GB109+1","v":8},null,null,null,{"$f":"GF109+1","v":9},null,null,null,{"$f":"GJ109+1","v":10},null,null,null,{"$f":"GN109+1","v":11},null,null,null,{"$f":"GR109+1","v":12},null,null,null,{"$f":"GV109+1","v":13},null,null,null,{"$f":"GZ109+1","v":14},null,null,null,{"$f":"HD109+1","v":15},null,null,null,{"$f":"HH109+1","v":16},null,null,null,{"$f":"HL109+1","v":17},null,null,null,{"$f":"HP109+1","v":18},null,null,null,{"$f":"HT109+1","v":19},null,null,null,{"$f":"HX109+1","v":20},null,null,null,{"$f":"IB109+1","v":21},null,null,null,{"$f":"IF109+1","v":22},null,null,null,{"$f":"IJ109+1","v":23},null,null,null,{"$f":"IN109+1","v":24},null,null,null,{"$f":"IR109+1","v":25}]
[null,null,null,null,null,null,null,null,null,null,null,null,null,null,null,null,null,null,null,null,null,null,null,null,null,null,null,null,null,null,null,null,null,null,null,null,null,null,null,null,null,null,null,null,null,{"$f":"IF(AV110=\"\",\"\",INDEX(A$25:$A$49,AV110))","v":""},"","","","","","",null,{"$f":"IF(AV110=\"\",\"\",INDEX(C$25:$C$49,AV110))","v":""},null,null,null,null,null,null,null,null,null,null,null,null,null,null,null,null,null,null,null,null,null,null,null,null,null,null,null,null,null,null,null,null,null,null,null,null,null,null,null,null,null,null,null,null,null,null,null,null,null,null,null,null,null,null,null,null,null,null,null,null,null,null,null,null,null,null,null,null,null,null,null,null,null,null,null,null,null,"DN","LTotal","Final","Ordenação Automática",null,null,null,"DN","R","LTotal","N","Di","Ltotal","Lreal","Freq.",null,null,null,null,null,null,null,null,null,null,null,null,null,"ΔPAcum.R.P.","ΔPAcum.Total","Nó Inicial","Nó Final","ΔP","Nó antecedente",null,"ΔP",null,"Nó antecedente",null,"ΔP",null,"Nó antecedente",null,"ΔP",null,"Nó antecedente",null,"ΔP",null,"Nó antecedente",null,"ΔP",null,"Nó antecedente",null,"ΔP",null,"Nó antecedente",null,"ΔP",null,"Nó antecedente",null,"ΔP",null,"Nó antecedente",null,"ΔP",null,"Nó antecedente",null,"ΔP",null,"Nó antecedente",null,"ΔP",null,"Nó antecedente",null,"ΔP",null,"Nó antecedente",null,"ΔP",null,"Nó antecedente",null,"ΔP",null,"Nó antecedente",null,"ΔP",null,"Nó antecedente",null,"ΔP",null,"Nó antecedente",null,"ΔP",null,"Nó antecedente",null,"ΔP",null,"Nó antecedente",null,"ΔP",null,"Nó antecedente",null,"ΔP",null,"Nó antecedente",null,"ΔP",null,"Nó antecedente",null,"ΔP",null,"Nó antecedente",null,"ΔP",null,"Nó antecedente",null,"ΔP"]
[null,null,null,null,null,null,null,null,null,null,null,null,null,null,null,null,null,null,null,null,null,null,null,null,null,null,null,null,null,null,null,null,null,null,null,null,null,null,null,null,null,null,null,null,null,{"$f":"IF(AV111=\"\",\"\",INDEX(A$25:$A$49,AV111))","v":""},"","","","","","",null,{"$f":"IF(AV111=\"\",\"\",INDEX(C$25:$C$49,AV111))","v":""},null,null,null,null,null,null,null,null,null,null,null,null,null,null,null,null,null,null,null,null,null,null,null,null,null,null,null,null,null,null,null,null,null,null,null,null,null,null,null,null,null,null,null,null,null,null,null,null,null,null,null,null,null,null,null,null,null,null,null,null,null,null,null,null,null,null,null,null,null,null,null,null,null,null,null,null,null,{"$f":"IF(ED111=\"\",\"\",LOOKUP(ED111,$EJ$111:$EJ$125,$EI$111:$EI$125))","v":""},{"$f":"IF(ED111=\"\",\"\",LOOKUP(ED111,$EH$111:$EH$125,$EK$111:$EK$125))","v":""},{"$f":"IF(AND(EE111=\"\",EF111=\"\",EG111=\"\"),\"\",MIN(EE111:EG111))","v":""},{"$f":"IF(OR(MIN($EH111:$EH125)=\"\",MIN($EH111:$EH125)=0),\"\",MIN($EH111:$EH125))","v":""},{"$f":"IF(OR(MIN($EH111:$EH125)=\"\",MIN($EH111:$EH125)=0),\"\",MIN($EH111:$EH125))","v":""},{"$f":"IF(OR(MIN($EH111:$EH125)=\"\",MIN($EH111:$EH125)=0),\"\",MIN($EH111:$EH125))","v":""},{"$f":"IF(OR($EK111=\"\",$EK111=0),\"\",$EJ111)","v":""},"DN 10",0.375,{"$f":"SUMIF($EM$112:$EM$136,12.6,$EN$112:$EN$136)","v":0},"n.º","mm","m","m","Adoptada",null,null,null,null,null,null,null,null,"Nº",null,null,null,null,{"$f":"MAX(FD112:FD136)","v":0},{"$f":"MAX(FE112:FE136)","v":0},null,null,"kPa",null,null,"kPa",null,null,null,"kPa",null,null,null,"kPa",null,null,null,"kPa",null,null,null,"kPa",null,null,null,"kPa",null,null,null,"kPa",null,null,null,"kPa",null,null,null,"kPa",null,null,null,"kPa",null,null,null,"kPa",null,null,null,"kPa",null,null,null,"kPa",null,null,null,"kPa",null,null,null,"kPa",null,null,null,"kPa",null,null,null,"kPa",null,null,null,"kPa",null,null,null,"kPa",null,null,null,"kPa",null,null,null,"kPa",null,null,null,"kPa",null,null,null,"kPa",null,null,null,"kPa"]
[null,null,null,null,null,null,null,null,null,null,null,null,null,null,null,null,null,null,null,null,null,null,null,null,null,null,null,null,null,null,null,null,null,null,null,null,null,null,null,null,null,null,null,null,null,"Situação em que existe uma bifurcação entre o conjunto de sub-ramais de funcionamento simultâneo.",null,null,null,null,null,null,null,null,null,null,null,null,null,null,null,null,null,null,null,null,null,null,null,null,null,null,null,null,null,null,null,null,null,null,null,null,null,null,null,null,null,null,null,null,null,null,null,null,null,null,null,null,null,null,null,null,null,null,null,null,null,null,null,null,null,null,null,null,null,null,null,null,null,null,null,null,null,null,null,null,null,null,null,null,null,"","",{"$f":"IF(AND(EE112=\"\",EF112=\"\",EG112=\"\"),\"\",MIN(EE112:EG112))","v":""},{"$f":"IF($ED111=\"\",\"\",IF(AND($EH124<>\"\",$EH124>$ED111),$EH124,IF(AND($EH125<>\"\",$EH125>$ED111),$EH125,\"\")))","v":""},{"$f":"IF($ED111=\"\",\"\",IF(AND($EH118<>\"\",$EH118>$ED111),$EH118,IF(AND($EH119<>\"\",$EH119>$ED111),$EH119,IF(AND($EH120<>\"\",$EH120>$ED111),$EH120,IF(AND($EH121<>\"\",$EH121>$ED111),$EH121,IF(AND($EH122<>\"\",$EH122>$ED111),$EH122,IF(AND($EH123<>\"\",$EH123>$ED111),$EH123,\"\")))))))","v":""},{"$f":"IF($ED111=\"\",\"\",IF(AND($EH112<>\"\",$EH112>$ED111),$EH112,IF(AND($EH113<>\"\",$EH113>$ED111),$EH113,IF(AND($EH114<>\"\",$EH114>$ED111),$EH114,IF(AND($EH115<>\"\",$EH115>$ED111),$EH115,IF(AND($EH116<>\"\",$EH116>$ED111),$EH116,IF(AND($EH117<>\"\",$EH117>$ED111),$EH117,\"\")))))))","v":""},"","DN 15",0.5,{"$f":"SUMIF($EM$112:$EM$136,16.1,$EN$112:$EN$136)","v":0},{"$f":"E25","v":""},{"$f":"IF(W25=\"\",0,W25)","v":0},{"$f":"EO112*EP112","v":0},{"$f":"J25","v":0},{"$f":"IF(AR25=\"\",1,AR25)","v":1},null,null,null,null,null,null,null,null,1,null,null,null,null,{"$f":"IF(OR(D25=\"s\",FF112=\"\",FG112=\"\"),\"\",FE112)","v":""},{"$f":"FH112+FK112+FO112+FS112+FW112+GA112+GE112+GI112+GM112+GQ112+GU112+GY112+HC112+HG112+HK112+HO112+HS112+HW112+IA112+IE112+II112+IM112+IQ112+IU112+IY112","v":0},{"$f":"IF(OR(F25=\"\",G25=\"\"),\"\",F25)","v":""},{"$f":"IF(OR(F25=\"\",G25=\"\"),\"\",G25)","v":""},{"$f":"IF(OR($AF25=\"\",$FG112=\"\"),0,$AF25)","v":0},null,{"$f":"FJ83","v":""},{"$f":"IF(FJ112=\"\",0,LOOKUP(FJ112,$EY$112:$EY$136,$FH$112:$FH$136))","v":0},null,null,{"$f":"FN83","v":""},{"$f":"IF(FN112=\"\",0,LOOKUP(FN112,$EY$112:$EY$136,$FH$112:$FH$136))","v":0},null,null,{"$f":"FR83","v":""},{"$f":"IF(FR112=\"\",0,LOOKUP(FR112,$EY$112:$EY$136,$FH$112:$FH$136))","v":0},null,null,{"$f":"FV83","v":""},{"$f":"IF(FV112=\"\",0,LOOKUP(FV112,$EY$112:$EY$136,$FH$112:$FH$136))","v":0},null,null,{"$f":"FZ83","v":""},{"$f":"IF(FZ112=\"\",0,LOOKUP(FZ112,$EY$112:$EY$136,$FH$112:$FH$136))","v":0},null,null,{"$f":"GD83","v":""},{"$f":"IF(GD112=\"\",0,LOOKUP(GD112,$EY$112:$EY$136,$FH$112:$FH$136))","v":0},null,null,{"$f":"GH83","v":""},{"$f":"IF(GH112=\"\",0,LOOKUP(GH112,$EY$112:$EY$136,$FH$112:$FH$136))","v":0},null,null,{"$f":"GL83","v":""},{"$f":"IF(GL112=\"\",0,LOOKUP(GL112,$EY$112:$EY$136,$FH$112:$FH$136))","v":0},null,null,{"$f":"GP83","v":""},{"$f":"IF(GP112=\"\",0,LOOKUP(GP112,$EY$112:$EY$136,$FH$112:$FH$136))","v":0},null,null,{"$f":"GT83","v":""},{"$f":"IF(GT112=\"\",0,LOOKUP(GT112,$EY$112:$EY$136,$FH$112:$FH$136))","v":0},null,null,{"$f":"GX83","v":""},{"$f":"IF(GX112=\"\",0,LOOKUP(GX112,$EY$112:$EY$136,$FH$112:$FH$136))","v":0},null,null,{"$f":"HB83","v":""},{"$f":"IF(HB112=\"\",0,LOOKUP(HB112,$EY$112:$EY$136,$FH$112:$FH$136))","v":0},null,null,{"$f":"HF83","v":""},{"$f":"IF(HF112=\"\",0,LOOKUP(HF112,$EY$112:$EY$136,$FH$112:$FH$136))","v":0},null,null,{"$f":"HJ83","v":""},{"$f":"IF(HJ112=\"\",0,LOOKUP(HJ112,$EY$112:$EY$136,$FH$112:$FH$136))","v":0},null,null,{"$f":"HN83","v":""},{"$f":"IF(HN112=\"\",0,LOOKUP(HN112,$EY$112:$EY$136,$FH$112:$FH$136))","v":0},null,null,{"$f":"HR83","v":""},{"$f":"IF(HR112=\"\",0,LOOKUP(HR112,$EY$112:$EY$136,$FH$112:$FH$136))","v":0},null,null,{"$f":"HV83","v":""},{"$f":"IF(HV112=\"\",0,LOOKUP(HV112,$EY$112:$EY$136,$FH$112:$FH$136))","v":0},null,null,{"$f":"HZ83","v":""},{"$f":"IF(HZ112=\"\",0,LOOKUP(HZ112,$EY$112:$EY$136,$FH$112:$FH$136))","v":0},null,null,{"$f":"ID83","v":""},{"$f":"IF(ID112=\"\",0,LOOKUP(ID112,$EY$112:$EY$136,$FH$112:$FH$136))","v":0},null,null,{"$f":"IH83","v":""},{"$f":"IF(IH112=\"\",0,LOOKUP(IH112,$EY$112:$EY$136,$FH$112:$FH$136))","v":0},null,null,{"$f":"IL83","v":""},{"$f":"IF(IL112=\"\",0,LOOKUP(IL112,$EY$112:$EY$136,$FH$112:$FH$136))","v":0},null,null,{"$f":"IP83","v":""},{"$f":"IF(IP112=\"\",0,LOOKUP(IP112,$EY$112:$EY$136,$FH$112:$FH$136))","v":0},null,null,{"$f":"IT83","v":""},{"$f":"IF(IT112=\"\",0,LOOKUP(IT112,$EY$112:$EY$136,$FH$112:$FH$136))","v":0},null,null,{"$f":"IX83","v":""},{"$f":"IF(IX112=\"\",0,LOOKUP(IX112,$EY$112:$EY$136,$FH$112:$FH$136))","v":0}]
[null,null,null,null,null,null,null,null,null,null,null,null,null,null,null,null,null,null,null,null,null,null,null,null,null,null,null,null,null,null,null,null,null,null,null,null,null,null,null,null,null,null,null,null,null,"Caudais referentes aos Sub-Ramais em funcionamento simultâneo",null,null,null,null,null,null,"Caudais calculados directamente e ordenados de modo crescente",null,"Caudais calculados directamente e ordenados de modo decrescente","Nº de sprinklers em funcionamento simultâneo por sub-ramal","Nº Sub-ramais","Nº Sub-ramais",null,null,null,null,null,null,null,null,null,null,null,null,null,null,"Distinção entre Bifurcações",null,null,"Lreal",null,null,"Lreal",null,null,"Lreal",null,null,"Lreal",null,null,"Lreal",null,null,"Lreal",null,null,"Lreal",null,null,"Lreal",null,null,null,null,null,null,null,null,null,null,null,null,null,null,null,null,null,null,null,null,null,null,null,null,null,null,null,null,null,null,null,null,null,null,"","","",{"$f":"IF($ED112=\"\",\"\",IF(AND($EH125<>\"\",$EH125>$ED112),$EH125,\"\"))","v":""},{"$f":"IF($ED112=\"\",\"\",IF(AND($EH119<>\"\",$EH119>$ED112),$EH119,IF(AND($EH120<>\"\",$EH120>$ED112),$EH120,IF(AND($EH121<>\"\",$EH121>$ED112),$EH121,IF(AND($EH122<>\"\",$EH122>$ED112),$EH122,IF(AND($EH123<>\"\",$EH123>$ED112),$EH123,IF(AND($EH124<>\"\",$EH124>$ED112),$EH124,\"\")))))))","v":""},"","","DN 20",0.75,{"$f":"SUMIF($EM$112:$EM$136,21.7,$EN$112:$EN$136)","v":0},"",0,{"$f":"EO113*EP113","v":0},0,1,null,null,null,null,null,null,null,null,2,null,null,null,null,"",0,"","",0,null,{"$f":"FJ84","v":""},0,null,null,{"$f":"FN84","v":""},0,null,null,{"$f":"FR84","v":""},0,null,null,{"$f":"FV84","v":""},0,null,null,{"$f":"FZ84","v":""},0,null,null,{"$f":"GD84","v":""},0,null,null,{"$f":"GH84","v":""},0,null,null,{"$f":"GL84","v":""},0,null,null,{"$f":"GP84","v":""},0,null,null,{"$f":"GT84","v":""},0,null,null,{"$f":"GX84","v":""},0,null,null,{"$f":"HB84","v":""},0,null,null,{"$f":"HF84","v":""},0,null,null,{"$f":"HJ84","v":""},0,null,null,{"$f":"HN84","v":""},0,null,null,{"$f":"HR84","v":""},0,null,null,{"$f":"HV84","v":""},0,null,null,{"$f":"HZ84","v":""},0,null,null,{"$f":"ID84","v":""},0,null,null,{"$f":"IH84","v":""},0,null,null,{"$f":"IL84","v":""},0,null,null,{"$f":"IP84","v":""},0,null,null,{"$f":"IT84","v":""},0,null,null,{"$f":"IX84","v":""},0]
[null,null,null,null,null,null,null,null,null,null,null,null,null,null,null,null,null,null,null,null,null,null,null,null,null,null,null,null,null,null,null,null,null,null,null,null,null,null,null,null,null,null,null,null,null,null,null,null,null,"Pi","Qsub-ramal",null,"Qsub-ramal","Simultâneos com caudal obtido por analogia","Qacum.","NSsim.troço","Simultâneos","Simultâneos com caudal calculado directamente",null,"Bifurcações com caudal obtido por analogia",null,null,null,null,1,2,3,4,5,6,7,8,"com caudal obtido por analogia",null,null,"m",null,1,"m",null,2,"m",null,3,"m",null,4,"m",null,5,"m",null,6,"m",null,7,"m",null,8,null,null,null,null,null,null,null,null,null,null,null,null,null,null,null,null,null,null,null,null,null,null,null,null,null,null,null,null,null,null,null,null,"","","",null,{"$f":"IF($ED113=\"\",\"\",IF(AND($EH120<>\"\",$EH120>$ED113),$EH120,IF(AND($EH121<>\"\",$EH121>$ED113),$EH121,IF(AND($EH122<>\"\",$EH122>$ED113),$EH122,IF(AND($EH123<>\"\",$EH123>$ED113),$EH123,IF(AND($EH124<>\"\",$EH124>$ED113),$EH124,IF(AND($EH125<>\"\",$EH125>$ED113),$EH125,\"\")))))))","v":""},"","","DN 25",1,{"$f":"SUMIF($EM$112:$EM$136,27.3,$EN$112:$EN$136)","v":0},"",0,0,0,1,null,null,null,null,null,null,null,null,3,null,null,null,null,"",0,"","",0,null,"",0,null,null,"",0,null,null,"",0,null,null,"",0,null,null,"",0,null,null,"",0,null,null,"",0,null,null,"",0,null,null,"",0,null,null,"",0,null,null,"",0,null,null,"",0,null,null,"",0,null,null,"",0,null,null,"",0,null,null,"",0,null,null,"",0,null,null,"",0,null,null,"",0,null,null,"",0,null,null,"",0,null,null,"",0,null,null,"",0,null,null,"",0]
[null,null,null,null,null,null,null,null,null,null,null,null,null,null,null,null,null,null,null,null,null,null,null,null,null,null,null,null,null,null,null,null,null,null,null,null,null,null,null,null,null,null,null,null,null,"Nó inicial","Posição","Estatuto do troço",null,{"$f":"AC24","v":"kPa"},{"$f":"AY100","v":"l/min"},"nº",{"$f":"AV84","v":"l/min"},{"$f":"IF(OR(BE115=\"\",BF115=\"\",BF115<BE115/2),\"\",BE115-BF115)","v":""},{"$f":"SUM(BC116:BC124)","v":0},{"$f":"IF($AU$7=\"\",\"\",$AU$7)","v":4},{"$f":"IF($AU$7=0,\"\",IF(OR($AU$6=\"\",$AU$7=\"\"),\"\",$AU$6/$AU$7))","v":3},{"$f":"AY52","v":""},1,{"$f":"IF(OR($AT$116=\"\",$BB$80=\"\"),\"\",IF(LOOKUP($BB$80,$DN$54:$DN$78,DT$54:DT$78)=\"S1\",\"\",LOOKUP($BB$80,$DN$54:$DN$78,DT$54:DT$78)))","v":""},{"$f":"IF(AND(LEN(BH115)>1,LEFT(BH115,1)=\"s\",OR(RIGHT(BH115,1)=\"0\",RIGHT(BH115,1)=\"1\",RIGHT(BH115,1)=\"2\",RIGHT(BH115,1)=\"3\",RIGHT(BH115,1)=\"4\",RIGHT(BH115,1)=\"5\",RIGHT(BH115,1)=\"6\",RIGHT(BH115,1)=\"7\",RIGHT(BH115,1)=\"8\",RIGHT(BH115,1)=\"9\")),\"\",BH115)","v":""},1,{"$f":"IF(BL115=0,0,VLOOKUP(BL115,$AZ$116:$BD$124,5,FALSE))","v":0},{"$f":"IF(OR(F25=\"\",F25=$AT$116,DP25=1,D25<>\"s\"),0,SUM(BM115:BT115)+BU115)","v":0},{"$f":"IF($BI$115=\"\",0,COUNTIF($DT25:$ER25,$BI$115))","v":0},{"$f":"IF($BI$116=\"\",0,COUNTIF($DT25:$ER25,$BI$116))","v":0},{"$f":"IF($BI$117=\"\",0,COUNTIF($DT25:$ER25,$BI$117))","v":0},{"$f":"IF($BI$118=\"\",0,COUNTIF($DT25:$ER25,$BI$118))","v":0},{"$f":"IF($BI$119=\"\",0,COUNTIF($DT25:$ER25,$BI$119))","v":0},{"$f":"IF($BI$120=\"\",0,COUNTIF($DT25:$ER25,$BI$120))","v":0},{"$f":"IF($BI$121=\"\",0,COUNTIF($DT25:$ER25,$BI$121))","v":0},{"$f":"IF($BI$122=\"\",0,COUNTIF($DT25:$ER25,$BI$122))","v":0},{"$f":"BZ115+CC115+CF115+CI115+CL115+CO115+CR115+CU115","v":0},{"$f":"F25","v":0},{"$f":"G25","v":0},{"$f":"IF(OR($BV115=0,D25<>\"s\"),0,IF($BV115=$BI$115,$J25,0))","v":0},{"$f":"IF($BX$140=0,0,IF(BX115=$BX$140,1,0))","v":0},{"$f":"IF($BY$141=\"\",0,COUNTIF($DT25:$ER25,$BY$141))","v":0},{"$f":"IF(OR($BV115=0,D25<>\"s\"),0,IF($BV115=$BI$116,$J25,0))","v":0},{"$f":"IF($CA$140=0,0,IF(CA115=$CA$140,1,0))","v":0},{"$f":"IF($CB$141=\"\",0,COUNTIF($DT25:$ER25,$CB$141))","v":0},{"$f":"IF(OR($BV115=0,D25<>\"s\"),0,IF($BV115=$BI$117,$J25,0))","v":0},{"$f":"IF($CD$140=0,0,IF(CD115=$CD$140,1,0))","v":0},{"$f":"IF($CE$141=\"\",0,COUNTIF($DT25:$ER25,$CE$141))","v":0},{"$f":"IF(OR($BV115=0,D25<>\"s\"),0,IF($BV115=$BI$118,$J25,0))","v":0},{"$f":"IF($CG$140=0,0,IF(CG115=$CG$140,1,0))","v":0},{"$f":"IF($CH$141=\"\",0,COUNTIF($DT25:$ER25,$CH$141))","v":0},{"$f":"IF(OR($BV115=0,D25<>\"s\"),0,IF($BV115=$BI$119,$J25,0))","v":0},{"$f":"IF($CJ$140=0,0,IF(CJ115=$CJ$140,1,0))","v":0},{"$f":"IF($CK$141=\"\",0,COUNTIF($DT25:$ER25,$CK$141))","v":0},{"$f":"IF(OR($BV115=0,D25<>\"s\"),0,IF($BV115=$BI$120,$J25,0))","v":0},{"$f":"IF($CM$140=0,0,IF(CM115=$CM$140,1,0))","v":0},{"$f":"IF($CN$141=\"\",0,COUNTIF($DT25:$ER25,$CN$141))","v":0},{"$f":"IF(OR($BV115=0,D25<>\"s\"),0,IF($BV115=$BI$121,$J25,0))","v":0},{"$f":"IF($CP$140=0,0,IF(CP115=$CP$140,1,0))","v":0},{"$f":"IF($CQ$141=\"\",0,COUNTIF($DT25:$ER25,$CQ$141))","v":0},{"$f":"IF(OR($BV115=0,D25<>\"s\"),0,IF($BV115=$BI$122,$J25,0))","v":0},{"$f":"IF($CS$140=0,0,IF(CS115=$CS$140,1,0))","v":0},{"$f":"IF($CT$141=\"\",0,COUNTIF($DT25:$ER25,$CT$141))","v":0},null,null,null,null,null,null,null,null,null,null,null,null,null,null,null,null,null,null,null,null,null,null,null,null,null,null,null,null,null,null,null,null,"","","",null,{"$f":"IF($ED114=\"\",\"\",IF(AND($EH121<>\"\",$EH121>$ED114),$EH121,IF(AND($EH122<>\"\",$EH122>$ED114),$EH122,IF(AND($EH123<>\"\",$EH123>$ED114),$EH123,IF(AND($EH124<>\"\",$EH124>$ED114),$EH124,IF(AND($EH125<>\"\",$EH125>$ED114),$EH125,\"\"))))))","v":""},"","","DN 32",1.25,{"$f":"SUMIF($EM$112:$EM$136,36,$EN$112:$EN$136)","v":0},"",0,0,0,1,null,null,null,null,null,null,null,null,4,null,null,null,null,"",0,"","",0,null,"",0,null,null,"",0,null,null,"",0,null,null,"",0,null,null,"",0,null,null,"",0,null,null,"",0,null,null,"",0,null,null,"",0,null,null,"",0,null,null,"",0,null,null,"",0,null,null,"",0,null,null,"",0,null,null,"",0,null,null,"",0,null,null,"",0,null,null,"",0,null,null,"",0,null,null,"",0,null,null,"",0,null,null,"",0,null,null,"",0,null,null,"",0]
[null,null,null,null,null,null,null,null,null,null,null,null,null,null,null,null,null,null,null,null,null,null,null,null,null,null,null,null,null,null,null,null,null,null,null,null,null,null,null,null,null,null,null,null,null,{"$f":"IF(EV53=\"\",\"\",EV53)","v":""},{"$f":"IF(BA23=\"\",\"\",BA23)","v":""},{"$f":"IF(OR(AT116=\"\",AU116=\"\"),\"\",INDEX(B$25:$B$49,AU116))","v":""},{"$f":"IF(OR(AT116=\"\",AU116=\"\"),\"\",INDEX($C$25:C$49,AU116))","v":""},{"$f":"IF(AU116=\"\",\"\",IF(AND(AV116=\"c\",AW116=\"s\"),\"\",INDEX($AC$25:$AC$49,AU116)))","v":""},{"$f":"IFERROR(IF(AX116=\"\",\"\",$B$17*$AZ$101*SQRT(AX116*(1/100)*(1/$B$18))),\"\")","v":""},{"$f":"IF(OR(AT116=\"\",BF115=\"\",BF115<=0),\"\",IF(1<=$BF$115,1,\"\"))","v":""},{"$f":"IFERROR(IF(AZ116=\"\",\"\",SMALL($AY$116:$AY$125,AZ116)),\"\")","v":""},{"$f":"IF(OR(BB115=0,BB115=\"\"),\"\",BB115)","v":""},{"$f":"IFERROR(IF(BB116=\"\",\"\",LARGE($BA$116:$BA$124,AZ116)),\"\")","v":""},{"$f":"IF(OR($N$23=0,BC116=\"\"),\"\",BC116/$N$23)","v":""},null,null,2,{"$f":"IF(OR($AT$116=\"\",$BB$80=\"\"),\"\",IF(LOOKUP($BB$80,$DN$54:$DN$78,DU$54:DU$78)=\"S1\",\"\",LOOKUP($BB$80,$DN$54:$DN$78,DU$54:DU$78)))","v":""},"",2,{"$f":"IF(BL116=0,0,VLOOKUP(BL116,$AZ$116:$BD$124,5,FALSE))","v":0},0,{"$f":"IF($BI$115=\"\",0,COUNTIF($DT26:$ER26,$BI$115))","v":0},0,0,0,0,0,0,0,{"$f":"BZ116+CC116+CF116+CI116+CL116+CO116+CR116+CU116","v":0},0,0,0,{"$f":"IF($BX$140=0,0,IF(BX116=$BX$140,1,0))","v":0},{"$f":"IF($BY$141=\"\",0,COUNTIF($DT26:$ER26,$BY$141))","v":0},0,{"$f":"IF($CA$140=0,0,IF(CA116=$CA$140,1,0))","v":0},{"$f":"IF($CB$141=\"\",0,COUNTIF($DT26:$ER26,$CB$141))","v":0},0,{"$f":"IF($CD$140=0,0,IF(CD116=$CD$140,1,0))","v":0},{"$f":"IF($CE$141=\"\",0,COUNTIF($DT26:$ER26,$CE$141))","v":0},0,{"$f":"IF($CG$140=0,0,IF(CG116=$CG$140,1,0))","v":0},{"$f":"IF($CH$141=\"\",0,COUNTIF($DT26:$ER26,$CH$141))","v":0},0,{"$f":"IF($CJ$140=0,0,IF(CJ116=$CJ$140,1,0))","v":0},{"$f":"IF($CK$141=\"\",0,COUNTIF($DT26:$ER26,$CK$141))","v":0},0,{"$f":"IF($CM$140=0,0,IF(CM116=$CM$140,1,0))","v":0},{"$f":"IF($CN$141=\"\",0,COUNTIF($DT26:$ER26,$CN$141))","v":0},0,{"$f":"IF($CP$140=0,0,IF(CP116=$CP$140,1,0))","v":0},{"$f":"IF($CQ$141=\"\",0,COUNTIF($DT26:$ER26,$CQ$141))","v":0},0,{"$f":"IF($CS$140=0,0,IF(CS116=$CS$140,1,0))","v":0},{"$f":"IF($CT$141=\"\",0,COUNTIF($DT26:$ER26,$CT$141))","v":0},null,null,null,null,null,null,null,null,null,null,null,null,null,null,null,null,null,null,null,null,null,null,null,null,null,null,null,null,null,null,null,null,"","","",null,{"$f":"IF($ED115=\"\",\"\",IF(AND($EH122<>\"\",$EH122>$ED115),$EH122,IF(AND($EH123<>\"\",$EH123>$ED115),$EH123,IF(AND($EH124<>\"\",$EH124>$ED115),$EH124,IF(AND($EH125<>\"\",$EH125>$ED115),$EH125,\"\")))))","v":""},"","","DN 40",1.5,{"$f":"SUMIF($EM$112:$EM$136,41.9,$EN$112:$EN$136)","v":0},"",0,0,0,1,null,null,null,null,null,null,null,null,5,null,null,null,null,"",0,"","",0,null,"",0,null,null,"",0,null,null,"",0,null,null,"",0,null,null,"",0,null,null,"",0,null,null,"",0,null,null,"",0,null,null,"",0,null,null,"",0,null,null,"",0,null,null,"",0,null,null,"",0,null,null,"",0,null,null,"",0,null,null,"",0,null,null,"",0,null,null,"",0,null,null,"",0,null,null,"",0,null,null,"",0,null,null,"",0,null,null,"",0,null,null,"",0]
[null,null,null,null,null,null,null,null,null,null,null,null,null,null,null,null,null,null,null,null,null,null,null,null,null,null,null,null,null,null,null,null,null,null,null,null,null,null,null,null,null,null,null,null,null,{"$f":"IF(OR(AT116=\"\",$BB$79=\"\"),\"\",IF(LOOKUP($BB$79,$DN$54:$DN$78,DT$54:DT$78)=\"S1\",\"\",LOOKUP($BB$79,$DN$54:$DN$78,DT$54:DT$78)))","v":""},{"$f":"IFERROR(IF(AT117=\"\",\"\",MATCH(AT117,$F$25:$F$49,0)),\"\")","v":""},{"$f":"IF(OR(AT117=\"\",AU117=\"\"),\"\",INDEX(B$25:$B$49,AU117))","v":""},{"$f":"IF(OR(AT117=\"\",AU117=\"\"),\"\",INDEX($C$25:C$49,AU117))","v":""},{"$f":"IF(AU117=\"\",\"\",IF(AND(AV117=\"c\",AW117=\"s\"),\"\",INDEX($AC$25:$AC$49,AU117)))","v":""},{"$f":"IFERROR(IF(AX117=\"\",\"\",$B$17*$AZ$101*SQRT(AX117*(1/100)*(1/$B$18))),\"\")","v":""},{"$f":"IF(OR($AZ$116=\"\",AZ116=\"\"),\"\",IF(AZ116+1<=$BF$115,AZ116+1,\"\"))","v":""},{"$f":"IFERROR(IF(AZ117=\"\",\"\",SMALL($AY$116:$AY$125,AZ117)),\"\")","v":""},{"$f":"IF(BB116=\"\",\"\",IF((BB116-1)>0,BB116-1,\"\"))","v":""},{"$f":"IFERROR(IF(BB117=\"\",\"\",LARGE($BA$116:$BA$124,AZ117)),\"\")","v":""},{"$f":"IF(OR($N$23=0,BC117=\"\"),\"\",BC117/$N$23)","v":""},null,null,3,{"$f":"IF(OR($AT$116=\"\",$BB$80=\"\"),\"\",IF(LOOKUP($BB$80,$DN$54:$DN$78,DV$54:DV$78)=\"S1\",\"\",LOOKUP($BB$80,$DN$54:$DN$78,DV$54:DV$78)))","v":""},"",3,0,0,0,0,0,0,0,0,0,0,0,0,0,0,0,0,0,0,0,0,0,0,0,0,0,0,0,0,0,0,0,0,0,0,0,0,0,null,null,null,null,null,null,null,null,null,null,null,null,null,null,null,null,null,null,null,null,null,null,null,null,null,null,null,null,null,null,null,null,"","","",null,{"$f":"IF($ED116=\"\",\"\",IF(AND($EH123<>\"\",$EH123>$ED116),$EH123,IF(AND($EH124<>\"\",$EH124>$ED116),$EH124,IF(AND($EH125<>\"\",$EH125>$ED116),$EH125,\"\"))))","v":""},"","","DN 50",2,{"$f":"SUMIF($EM$112:$EM$136,53.1,$EN$112:$EN$136)","v":0},"",0,0,0,1,null,null,null,null,null,null,null,null,6,null,null,null,null,"",0,"","",0,null,"",0,null,null,"",0,null,null,"",0,null,null,"",0,null,null,"",0,null,null,"",0,null,null,"",0,null,null,"",0,null,null,"",0,null,null,"",0,null,null,"",0,null,null,"",0,null,null,"",0,null,null,"",0,null,null,"",0,null,null,"",0,null,null,"",0,null,null,"",0,null,null,"",0,null,null,"",0,null,null,"",0,null,null,"",0,null,null,"",0,null,null,"",0]
[null,null,null,null,null,null,null,null,null,null,null,null,null,null,null,null,null,null,null,null,null,null,null,null,null,null,null,null,null,null,null,null,null,null,null,null,null,null,null,null,null,null,null,null,null,{"$f":"IF(OR(AT116=\"\",$BB$79=\"\"),\"\",IF(LOOKUP($BB$79,$DN$54:$DN$78,DU$54:DU$78)=\"S1\",\"\",LOOKUP($BB$79,$DN$54:$DN$78,DU$54:DU$78)))","v":""},{"$f":"IFERROR(IF(AT118=\"\",\"\",MATCH(AT118,$F$25:$F$49,0)),\"\")","v":""},{"$f":"IF(OR(AT118=\"\",AU118=\"\"),\"\",INDEX(B$25:$B$49,AU118))","v":""},{"$f":"IF(OR(AT118=\"\",AU118=\"\"),\"\",INDEX($C$25:C$49,AU118))","v":""},{"$f":"IF(AU118=\"\",\"\",IF(AND(AV118=\"c\",AW118=\"s\"),\"\",INDEX($AC$25:$AC$49,AU118)))","v":""},"",{"$f":"IF(OR($AZ$116=\"\",AZ117=\"\"),\"\",IF(AZ117+1<=$BF$115,AZ117+1,\"\"))","v":""},{"$f":"IFERROR(IF(AZ118=\"\",\"\",SMALL($AY$116:$AY$125,AZ118)),\"\")","v":""},{"$f":"IF(BB117=\"\",\"\",IF((BB117-1)>0,BB117-1,\"\"))","v":""},{"$f":"IFERROR(IF(BB118=\"\",\"\",LARGE($BA$116:$BA$124,AZ118)),\"\")","v":""},"",null,null,4,{"$f":"IF(OR($AT$116=\"\",$BB$80=\"\"),\"\",IF(LOOKUP($BB$80,$DN$54:$DN$78,DW$54:DW$78)=\"S1\",\"\",LOOKUP($BB$80,$DN$54:$DN$78,DW$54:DW$78)))","v":""},"",4,0,0,0,0,0,0,0,0,0,0,0,0,0,0,0,0,0,0,0,0,0,0,0,0,0,0,0,0,0,0,0,0,0,0,0,0,0,null,null,null,null,null,null,null,null,null,null,null,null,null,null,null,null,null,null,null,null,null,null,null,null,null,null,null,null,null,null,null,null,"","","",null,{"$f":"IF($ED117=\"\",\"\",IF(AND($EH124<>\"\",$EH124>$ED117),$EH124,IF(AND($EH125<>\"\",$EH125>$ED117),$EH125,\"\")))","v":""},"","","DN 65",2.5,{"$f":"SUMIF($EM$112:$EM$136,68.9,$EN$112:$EN$136)","v":0},"",0,0,0,1,null,null,null,null,null,null,null,null,7,null,null,null,null,"",0,"","",0,null,"",0,null,null,"",0,null,null,"",0,null,null,"",0,null,null,"",0,null,null,"",0,null,null,"",0,null,null,"",0,null,null,"",0,null,null,"",0,null,null,"",0,null,null,"",0,null,null,"",0,null,null,"",0,null,null,"",0,null,null,"",0,null,null,"",0,null,null,"",0,null,null,"",0,null,null,"",0,null,null,"",0,null,null,"",0,null,null,"",0,null,null,"",0]
[null,null,null,null,null,null,null,null,null,null,null,null,null,null,null,null,null,null,null,null,null,null,null,null,null,null,null,null,null,null,null,null,null,null,null,null,null,null,null,null,null,null,null,null,null,{"$f":"IF(OR(AT116=\"\",$BB$79=\"\"),\"\",IF(LOOKUP($BB$79,$DN$54:$DN$78,DV$54:DV$78)=\"S1\",\"\",LOOKUP($BB$79,$DN$54:$DN$78,DV$54:DV$78)))","v":""},"",{"$f":"IF(OR(AT119=\"\",AU119=\"\"),\"\",INDEX(B$25:$B$49,AU119))","v":""},{"$f":"IF(OR(AT119=\"\",AU119=\"\"),\"\",INDEX($C$25:C$49,AU119))","v":""},{"$f":"IF(AU119=\"\",\"\",IF(AND(AV119=\"c\",AW119=\"s\"),\"\",INDEX($AC$25:$AC$49,AU119)))","v":""},"","","",{"$f":"IF(BB118=\"\",\"\",IF((BB118-1)>0,BB118-1,\"\"))","v":""},"","",null,null,5,{"$f":"IF(OR($AT$116=\"\",$BB$80=\"\"),\"\",IF(LOOKUP($BB$80,$DN$54:$DN$78,DX$54:DX$78)=\"S1\",\"\",LOOKUP($BB$80,$DN$54:$DN$78,DX$54:DX$78)))","v":""},"",5,0,0,0,0,0,0,0,0,0,0,0,0,0,0,0,0,0,0,0,0,0,0,0,0,0,0,0,0,0,0,0,0,0,0,0,0,0,null,null,null,null,null,null,null,null,null,null,null,null,null,null,null,null,null,null,null,null,null,null,null,null,null,null,null,null,null,null,null,null,"","","",null,{"$f":"IF($ED118=\"\",\"\",IF(AND($EH125<>\"\",$EH125>$ED118),$EH125,\"\"))","v":""},"","","DN 80",3,{"$f":"SUMIF($EM$112:$EM$136,80.9,$EN$112:$EN$136)","v":0},"",0,0,0,1,null,null,null,null,null,null,null,null,8,null,null,null,null,"",0,"","",0,null,"",0,null,null,"",0,null,null,"",0,null,null,"",0,null,null,"",0,null,null,"",0,null,null,"",0,null,null,"",0,null,null,"",0,null,null,"",0,null,null,"",0,null,null,"",0,null,null,"",0,null,null,"",0,null,null,"",0,null,null,"",0,null,null,"",0,null,null,"",0,null,null,"",0,null,null,"",0,null,null,"",0,null,null,"",0,null,null,"",0,null,null,"",0]
[null,null,null,null,null,null,null,null,null,null,null,null,null,null,null,null,null,null,null,null,null,null,null,null,null,null,null,null,null,null,null,null,null,null,null,null,null,null,null,null,null,null,null,null,null,{"$f":"IF(OR(AT116=\"\",$BB$79=\"\"),\"\",IF(LOOKUP($BB$79,$DN$54:$DN$78,DW$54:DW$78)=\"S1\",\"\",LOOKUP($BB$79,$DN$54:$DN$78,DW$54:DW$78)))","v":""},"",{"$f":"IF(OR(AT120=\"\",AU120=\"\"),\"\",INDEX(B$25:$B$49,AU120))","v":""},{"$f":"IF(OR(AT120=\"\",AU120=\"\"),\"\",INDEX($C$25:C$49,AU120))","v":""},{"$f":"IF(AU120=\"\",\"\",IF(AND(AV120=\"c\",AW120=\"s\"),\"\",INDEX($AC$25:$AC$49,AU120)))","v":""},"","","","","","",null,null,6,{"$f":"IF(OR($AT$116=\"\",$BB$80=\"\"),\"\",IF(LOOKUP($BB$80,$DN$54:$DN$78,DY$54:DY$78)=\"S1\",\"\",LOOKUP($BB$80,$DN$54:$DN$78,DY$54:DY$78)))","v":""},"",6,0,0,0,0,0,0,0,0,0,0,0,0,0,0,0,0,0,0,0,0,0,0,0,0,0,0,0,0,0,0,0,0,0,0,0,0,0,null,null,null,null,null,null,null,null,null,null,null,null,null,null,null,null,null,null,null,null,null,null,null,null,null,null,null,null,null,null,null,null,"","","",null,null,"","","DN 100",4,{"$f":"SUMIF($EM$112:$EM$136,105.3,$EN$112:$EN$136)","v":0},"",0,0,0,1,null,null,null,null,null,null,null,null,9,null,null,null,null,"",0,"","",0,null,"",0,null,null,"",0,null,null,"",0,null,null,"",0,null,null,"",0,null,null,"",0,null,null,"",0,null,null,"",0,null,null,"",0,null,null,"",0,null,null,"",0,null,null,"",0,null,null,"",0,null,null,"",0,null,null,"",0,null,null,"",0,null,null,"",0,null,null,"",0,null,null,"",0,null,null,"",0,null,null,"",0,null,null,"",0,null,null,"",0,null,null,"",0]
[null,null,null,null,null,null,null,null,null,null,null,null,null,null,null,null,null,null,null,null,null,null,null,null,null,null,null,null,null,null,null,null,null,null,null,null,null,null,null,null,null,null,null,null,null,{"$f":"IF(OR(AT116=\"\",$BB$79=\"\"),\"\",IF(LOOKUP($BB$79,$DN$54:$DN$78,DX$54:DX$78)=\"S1\",\"\",LOOKUP($BB$79,$DN$54:$DN$78,DX$54:DX$78)))","v":""},"",{"$f":"IF(OR(AT121=\"\",AU121=\"\"),\"\",INDEX(B$25:$B$49,AU121))","v":""},{"$f":"IF(OR(AT121=\"\",AU121=\"\"),\"\",INDEX($C$25:C$49,AU121))","v":""},{"$f":"IF(AU121=\"\",\"\",IF(AND(AV121=\"c\",AW121=\"s\"),\"\",INDEX($AC$25:$AC$49,AU121)))","v":""},"","","","","","",null,null,7,{"$f":"IF(OR($AT$116=\"\",$BB$80=\"\"),\"\",IF(LOOKUP($BB$80,$DN$54:$DN$78,DZ$54:DZ$78)=\"S1\",\"\",LOOKUP($BB$80,$DN$54:$DN$78,DZ$54:DZ$78)))","v":""},"",7,0,0,0,0,0,0,0,0,0,0,0,0,0,0,0,0,0,0,0,0,0,0,0,0,0,0,0,0,0,0,0,0,0,0,0,0,0,null,null,null,null,null,null,null,null,null,null,null,null,null,null,null,null,null,null,null,null,null,null,null,null,null,null,null,null,null,null,null,null,"","","",null,null,{"$f":"IF($ED120=\"\",\"\",IF(AND($EH121<>\"\",$EH121>$ED120),$EH121,IF(AND($EH122<>\"\",$EH122>$ED120),$EH122,IF(AND($EH123<>\"\",$EH123>$ED120),$EH123,IF(AND($EH124<>\"\",$EH124>$ED120),$EH124,IF(AND($EH125<>\"\",$EH125>$ED120),$EH125,\"\"))))))","v":""},"","DN 125",5,{"$f":"SUMIF($EM$112:$EM$136,129.7,$EN$112:$EN$136)","v":0},"",0,0,0,1,null,null,null,null,null,null,null,null,10,null,null,null,null,"",0,"","",0,null,"",0,null,null,"",0,null,null,"",0,null,null,"",0,null,null,"",0,null,null,"",0,null,null,"",0,null,null,"",0,null,null,"",0,null,null,"",0,null,null,"",0,null,null,"",0,null,null,"",0,null,null,"",0,null,null,"",0,null,null,"",0,null,null,"",0,null,null,"",0,null,null,"",0,null,null,"",0,null,null,"",0,null,null,"",0,null,null,"",0,null,null,"",0]
[null,null,null,null,null,null,null,null,null,null,null,null,null,null,null,null,null,null,null,null,null,null,null,null,null,null,null,null,null,null,null,null,null,null,null,null,null,null,null,null,null,null,null,null,null,{"$f":"IF(OR(AT116=\"\",$BB$79=\"\"),\"\",IF(LOOKUP($BB$79,$DN$54:$DN$78,DY$54:DY$78)=\"S1\",\"\",LOOKUP($BB$79,$DN$54:$DN$78,DY$54:DY$78)))","v":""},"",{"$f":"IF(OR(AT122=\"\",AU122=\"\"),\"\",INDEX(B$25:$B$49,AU122))","v":""},{"$f":"IF(OR(AT122=\"\",AU122=\"\"),\"\",INDEX($C$25:C$49,AU122))","v":""},{"$f":"IF(AU122=\"\",\"\",IF(AND(AV122=\"c\",AW122=\"s\"),\"\",INDEX($AC$25:$AC$49,AU122)))","v":""},"","","","","","",null,null,8,{"$f":"IF(OR($AT$116=\"\",$BB$80=\"\"),\"\",IF(LOOKUP($BB$80,$DN$54:$DN$78,EA$54:EA$78)=\"S1\",\"\",LOOKUP($BB$80,$DN$54:$DN$78,EA$54:EA$78)))","v":""},"",8,0,0,0,0,0,0,0,0,0,0,0,0,0,0,0,0,0,0,0,0,0,0,0,0,0,0,0,0,0,0,0,0,0,0,0,0,0,null,null,null,null,null,null,null,null,null,null,null,null,null,null,null,null,null,null,null,null,null,null,null,null,null,null,null,null,null,null,null,null,"","","",null,null,{"$f":"IF($ED121=\"\",\"\",IF(AND($EH122<>\"\",$EH122>$ED121),$EH122,IF(AND($EH123<>\"\",$EH123>$ED121),$EH123,IF(AND($EH124<>\"\",$EH124>$ED121),$EH124,IF(AND($EH125<>\"\",$EH125>$ED121),$EH125,\"\")))))","v":""},"","DN 150",6,{"$f":"SUMIF($EM$112:$EM$136,155.1,$EN$112:$EN$136)","v":0},"",0,0,0,1,null,null,null,null,null,null,null,null,11,null,null,null,null,"",0,"","",0,null,"",0,null,null,"",0,null,null,"",0,null,null,"",0,null,null,"",0,null,null,"",0,null,null,"",0,null,null,"",0,null,null,"",0,null,null,"",0,null,null,"",0,null,null,"",0,null,null,"",0,null,null,"",0,null,null,"",0,null,null,"",0,null,null,"",0,null,null,"",0,null,null,"",0,null,null,"",0,null,null,"",0,null,null,"",0,null,null,"",0,null,null,"",0]
[null,null,null,null,null,null,null,null,null,null,null,null,null,null,null,null,null,null,null,null,null,null,null,null,null,null,null,null,null,null,null,null,null,null,null,null,null,null,null,null,null,null,null,null,null,{"$f":"IF(OR(AT116=\"\",$BB$79=\"\"),\"\",IF(LOOKUP($BB$79,$DN$54:$DN$78,DZ$54:DZ$78)=\"S1\",\"\",LOOKUP($BB$79,$DN$54:$DN$78,DZ$54:DZ$78)))","v":""},"",{"$f":"IF(OR(AT123=\"\",AU123=\"\"),\"\",INDEX(B$25:$B$49,AU123))","v":""},{"$f":"IF(OR(AT123=\"\",AU123=\"\"),\"\",INDEX($C$25:C$49,AU123))","v":""},{"$f":"IF(AU123=\"\",\"\",IF(AND(AV123=\"c\",AW123=\"s\"),\"\",INDEX($AC$25:$AC$49,AU123)))","v":""},"","","","","","",null,null,null,null,null,9,0,0,0,0,0,0,0,0,0,0,0,0,0,0,0,0,0,0,0,0,0,0,0,0,0,0,0,0,0,0,0,0,0,0,0,0,0,null,null,null,null,null,null,null,null,null,null,null,null,null,null,null,null,null,null,null,null,null,null,null,null,null,null,null,null,null,null,null,null,"","","",null,null,{"$f":"IF($ED122=\"\",\"\",IF(AND($EH123<>\"\",$EH123>$ED122),$EH123,IF(AND($EH124<>\"\",$EH124>$ED122),$EH124,IF(AND($EH125<>\"\",$EH125>$ED122),$EH125,\"\"))))","v":""},"","DN 200",8,{"$f":"SUMIF($EM$112:$EM$136,206.5,$EN$112:$EN$136)","v":0},"",0,0,0,1,null,null,null,null,null,null,null,null,12,null,null,null,null,"",0,"","",0,null,"",0,null,null,"",0,null,null,"",0,null,null,"",0,null,null,"",0,null,null,"",0,null,null,"",0,null,null,"",0,null,null,"",0,null,null,"",0,null,null,"",0,null,null,"",0,null,null,"",0,null,null,"",0,null,null,"",0,null,null,"",0,null,null,"",0,null,null,"",0,null,null,"",0,null,null,"",0,null,null,"",0,null,null,"",0,null,null,"",0,null,null,"",0]
[null,null,null,null,null,null,null,null,null,null,null,null,null,null,null,null,null,null,null,null,null,null,null,null,null,null,null,null,null,null,null,null,null,null,null,null,null,null,null,null,null,null,null,null,null,{"$f":"IF(OR(AT116=\"\",$BB$79=\"\"),\"\",IF(LOOKUP($BB$79,$DN$54:$DN$78,EA$54:EA$78)=\"S1\",\"\",LOOKUP($BB$79,$DN$54:$DN$78,EA$54:EA$78)))","v":""},"",{"$f":"IF(OR(AT124=\"\",AU124=\"\"),\"\",INDEX(B$25:$B$49,AU124))","v":""},{"$f":"IF(OR(AT124=\"\",AU124=\"\"),\"\",INDEX($C$25:C$49,AU124))","v":""},{"$f":"IF(AU124=\"\",\"\",IF(AND(AV124=\"c\",AW124=\"s\"),\"\",INDEX($AC$25:$AC$49,AU124)))","v":""},"","","","",{"$f":"IFERROR(IF(BB124=\"\",\"\",LARGE($BA$116:$BA$124,AZ124)),\"\")","v":""},"",null,null,null,null,null,10,0,0,0,0,0,0,0,0,0,0,0,0,0,0,0,0,0,0,0,0,0,0,0,0,0,0,0,0,0,0,0,0,0,0,0,0,0,null,null,null,null,null,null,null,null,null,null,null,null,null,null,null,null,null,null,null,null,null,null,null,null,null,null,null,null,null,null,null,null,"","","",null,null,{"$f":"IF($ED123=\"\",\"\",IF(AND($EH124<>\"\",$EH124>$ED123),$EH124,IF(AND($EH125<>\"\",$EH125>$ED123),$EH125,\"\")))","v":""},"","DN 250",10,{"$f":"SUMIF($EM$112:$EM$136,260.4,$EN$112:$EN$136)","v":0},"",0,0,0,1,null,null,null,null,null,null,null,null,13,null,null,null,null,"",0,"","",0,null,"",0,null,null,"",0,null,null,"",0,null,null,"",0,null,null,"",0,null,null,"",0,null,null,"",0,null,null,"",0,null,null,"",0,null,null,"",0,null,null,"",0,null,null,"",0,null,null,"",0,null,null,"",0,null,null,"",0,null,null,"",0,null,null,"",0,null,null,"",0,null,null,"",0,null,null,"",0,null,null,"",0,null,null,"",0,null,null,"",0,null,null,"",0]
[null,null,null,null,null,null,null,null,null,null,null,null,null,null,null,null,null,null,null,null,null,null,null,null,null,null,null,null,null,null,null,null,null,null,null,null,null,null,null,null,null,null,null,null,null,null,null,null,null,null,{"$f":"IF(BF115=\"\",\"\",IF(N23=MIN(AY116:AY124),\"\",N23))","v":""},null,null,null,null,null,null,null,null,null,null,11,0,0,0,0,0,0,0,0,0,0,0,0,0,0,0,0,0,0,0,0,0,0,0,0,0,0,0,0,0,0,0,0,0,0,0,0,0,null,null,null,null,null,null,null,null,null,null,null,null,null,null,null,null,null,null,null,null,null,null,null,null,null,null,null,null,null,null,null,null,"","","",null,null,{"$f":"IF($ED124=\"\",\"\",IF(AND($EH125<>\"\",$EH125>$ED124),$EH125,\"\"))","v":""},"","DN 300",12,{"$f":"SUMIF($EM$112:$EM$136,311.3,$EN$112:$EN$136)","v":0},"",0,0,0,1,null,null,null,null,null,null,null,null,14,null,null,null,null,"",0,"","",0,null,"",0,null,null,"",0,null,null,"",0,null,null,"",0,null,null,"",0,null,null,"",0,null,null,"",0,null,null,"",0,null,null,"",0,null,null,"",0,null,null,"",0,null,null,"",0,null,null,"",0,null,null,"",0,null,null,"",0,null,null,"",0,null,null,"",0,null,null,"",0,null,null,"",0,null,null,"",0,null,null,"",0,null,null,"",0,null,null,"",0,null,null,"",0]
[null,null,null,null,null,null,null,null,null,null,null,null,null,null,null,null,null,null,null,null,null,null,null,null,null,null,null,null,null,null,null,null,null,null,null,null,null,null,null,null,null,null,null,null,null,null,null,null,null,null,null,null,null,null,null,null,null,null,null,null,null,12,0,0,0,0,0,0,0,0,0,0,0,0,0,0,0,0,0,0,0,0,0,0,0,0,0,0,0,0,0,0,0,0,0,0,0,0,0,null,null,null,null,null,null,null,null,null,null,null,null,null,null,null,null,null,null,null,null,null,null,null,null,null,null,null,null,null,null,null,null,null,null,null,null,null,null,null,null,null,null,"",0,0,0,1,null,null,null,null,null,null,null,null,15,null,null,null,null,"",0,"","",0,null,"",0,null,null,"",0,null,null,"",0,null,null,"",0,null,null,"",0,null,null,"",0,null,null,"",0,null,null,"",0,null,null,"",0,null,null,"",0,null,null,"",0,null,null,"",0,null,null,"",0,null,null,"",0,null,null,"",0,null,null,"",0,null,null,"",0,null,null,"",0,null,null,"",0,null,null,"",0,null,null,"",0,null,null,"",0,null,null,"",0,null,null,"",0]
[null,null,null,null,null,null,null,null,null,null,null,null,null,null,null,null,null,null,null,null,null,null,null,null,null,null,null,null,null,null,null,null,null,null,null,null,null,null,null,null,null,null,null,null,null,null,null,null,null,null,null,null,null,null,null,null,null,null,null,null,null,13,0,0,0,0,0,0,0,0,0,0,0,0,0,0,0,0,0,0,0,0,0,0,0,0,0,0,0,0,0,0,0,0,0,0,0,0,0,null,null,null,null,null,null,null,null,null,null,null,null,null,null,null,null,null,null,null,null,null,null,null,null,null,null,null,null,null,null,null,null,null,null,null,null,null,null,null,null,null,null,"",0,0,0,1,null,null,null,null,null,null,null,null,16,null,null,null,null,"",0,"","",0,null,"",0,null,null,"",0,null,null,"",0,null,null,"",0,null,null,"",0,null,null,"",0,null,null,"",0,null,null,"",0,null,null,"",0,null,null,"",0,null,null,"",0,null,null,"",0,null,null,"",0,null,null,"",0,null,null,"",0,null,null,"",0,null,null,"",0,null,null,"",0,null,null,"",0,null,null,"",0,null,null,"",0,null,null,"",0,null,null,"",0,null,null,"",0]
[null,null,null,null,null,null,null,null,null,null,null,null,null,null,null,null,null,null,null,null,null,null,null,null,null,null,null,null,null,null,null,null,null,null,null,null,null,null,null,null,null,null,null,null,null,"Factor de correcção dos caudais intermédios (sub-ramais)",null,null,null,null,null,null,null,null,null,null,null,null,null,null,null,14,0,0,0,0,0,0,0,0,0,0,0,0,0,0,0,0,0,0,0,0,0,0,0,0,0,0,0,0,0,0,0,0,0,0,0,0,0,null,null,null,null,null,null,null,null,null,null,null,null,null,null,null,null,null,null,null,null,null,null,null,null,null,null,null,null,null,null,null,null,null,null,null,null,null,null,"Diâmetro interior médio ponderado:","Di médio",{"$f":"IF(SUM(EN112:EN136)=0,\"\",(EM112*EN112+EM113*EN113+EM114*EN114+EM115*EN115+EM116*EN116+EM117*EN117+EM118*EN118+EM119*EN119+EM120*EN120+EM121*EN121+EM122*EN122+EM123*EN123+EM124*EN124+EM125*EN125+EM126*EN126+EM127*EN127+EM128*EN128+EM129*EN129+EM130*EN130+EM131*EN131+EM132*EN132+EM133*EN133+EM134*EN134+EM135*EN135+EM136*EN136)/SUM(EN112:EN136))","v":""},"mm","",0,0,0,1,null,null,null,null,null,null,null,null,17,null,null,null,null,"",0,"","",0,null,"",0,null,null,"",0,null,null,"",0,null,null,"",0,null,null,"",0,null,null,"",0,null,null,"",0,null,null,"",0,null,null,"",0,null,null,"",0,null,null,"",0,null,null,"",0,null,null,"",0,null,null,"",0,null,null,"",0,null,null,"",0,null,null,"",0,null,null,"",0,null,null,"",0,null,null,"",0,null,null,"",0,null,null,"",0,null,null,"",0,null,null,"",0]
[null,null,null,null,null,null,null,null,null,null,null,null,null,null,null,null,null,null,null,null,null,null,null,null,null,null,null,null,null,null,null,null,null,null,null,null,null,null,null,null,null,null,null,null,null,"Factor de correcção caudal intermédio (critério 1 proporcional)","Factor de correcção caudal intermédio (critério 2 simples)","NSsim.troço","NSsim.troço seguinte",null,"Mínimo",1,2,3,4,5,6,7,8,9,10,15,0,0,0,0,0,0,0,0,0,0,0,0,0,0,0,0,0,0,0,0,0,0,0,0,0,0,0,0,0,0,0,0,0,0,0,0,0,null,null,null,null,null,null,null,null,null,null,null,null,null,null,null,null,null,null,null,null,null,null,null,null,null,null,null,null,null,null,null,null,null,null,null,null,null,null,null,null,null,null,"",0,0,0,1,null,null,null,null,null,null,null,null,18,null,null,null,null,"",0,"","",0,null,"",0,null,null,"",0,null,null,"",0,null,null,"",0,null,null,"",0,null,null,"",0,null,null,"",0,null,null,"",0,null,null,"",0,null,null,"",0,null,null,"",0,null,null,"",0,null,null,"",0,null,null,"",0,null,null,"",0,null,null,"",0,null,null,"",0,null,null,"",0,null,null,"",0,null,null,"",0,null,null,"",0,null,null,"",0,null,null,"",0,null,null,"",0]
[null,null,null,null,null,null,null,null,null,null,null,null,null,null,null,null,null,null,null,null,null,null,null,null,null,null,null,null,null,null,null,null,null,null,null,null,null,null,null,null,null,null,null,null,1,{"$f":"IFERROR(IF(AND(OR(AX130=1,AY130=0),OR(AV130<=$AU$7,AV130>$AU$6,AV130-AW130=$AU$7,AV130-AW130=0)),1,LOOKUP(ABS(MAX((AV130-AW130),AY130)),$BB$85:$BB$93,$BG$85:$BG$93)),0)","v":1},{"$f":"IF(AND(OR(AX130=1,AY130=0),OR(AV130<=$AU$7,AV130>$AU$6,AV130-AW130=$AU$7,AV130-AW130=0)),1,ABS(MAX((AV130-AW130),AY130)/$AU$7))","v":1},{"$f":"H25","v":0},{"$f":"IF(FJ54=\"\",0,LOOKUP(FJ54,$DN$25:$DN$49,$H$25:$H$49))","v":0},{"$f":"IF(OR($AU$6-H25<0,$AU$6-H25=0,H25<=$AU$7,$AU$7-H25=0,2*$AU$7-H25=0,3*$AU$7-H25=0,4*$AU$7-H25=0,5*$AU$7-H25=0,6*$AU$7-H25=0,7*$AU$7-H25=0,8*$AU$7-H25=0,9*$AU$7-H25=0,10*$AU$7-H25=0),1,\"\")","v":1},{"$f":"MIN(AZ130:BI130)","v":4},{"$f":"IF($AU$7*AZ$129-$H25<-$AU$7,$AU$7,$AU$7*AZ$129-$H25)","v":4},{"$f":"IF($AU$7*BA$129-$H25<-$AU$7,$AU$7,$AU$7*BA$129-$H25)","v":8},12,16,20,24,28,32,36,40,16,0,0,0,0,0,0,0,0,0,0,0,0,0,0,0,0,0,0,0,0,0,0,0,0,0,0,0,0,0,0,0,0,0,0,0,0,0,null,null,null,null,null,null,null,null,null,null,null,null,null,null,null,null,null,null,null,null,null,null,null,null,null,null,null,null,null,null,null,null,null,null,null,null,null,null,null,null,null,null,"",0,0,0,1,null,null,null,null,null,null,null,null,19,null,null,null,null,"",0,"","",0,null,"",0,null,null,"",0,null,null,"",0,null,null,"",0,null,null,"",0,null,null,"",0,null,null,"",0,null,null,"",0,null,null,"",0,null,null,"",0,null,null,"",0,null,null,"",0,null,null,"",0,null,null,"",0,null,null,"",0,null,null,"",0,null,null,"",0,null,null,"",0,null,null,"",0,null,null,"",0,null,null,"",0,null,null,"",0,null,null,"",0,null,null,"",0]
[null,null,null,null,null,null,null,null,null,null,null,null,null,null,null,null,null,null,null,null,null,null,null,null,null,null,null,null,null,null,null,null,null,null,null,null,null,null,null,null,null,null,null,null,2,{"$f":"IFERROR(IF(AND(OR(AX131=1,AY131=0),OR(AV131<=$AU$7,AV131>$AU$6,AV131-AW131=$AU$7,AV131-AW131=0)),1,LOOKUP(ABS(MAX((AV131-AW131),AY131)),$BB$85:$BB$93,$BG$85:$BG$93)),0)","v":1},{"$f":"IF(AND(OR(AX131=1,AY131=0),OR(AV131<=$AU$7,AV131>$AU$6,AV131-AW131=$AU$7,AV131-AW131=0)),1,ABS(MAX((AV131-AW131),AY131)/$AU$7))","v":1},{"$f":"H26","v":0},0,1,{"$f":"MIN(AZ131:BI131)","v":4},{"$f":"IF($AU$7*AZ$129-$H26<-$AU$7,$AU$7,$AU$7*AZ$129-$H26)","v":4},8,12,16,20,24,28,32,36,40,17,0,0,0,0,0,0,0,0,0,0,0,0,0,0,0,0,0,0,0,0,0,0,0,0,0,0,0,0,0,0,0,0,0,0,0,0,0,null,null,null,null,null,null,null,null,null,null,null,null,null,null,null,null,null,null,null,null,null,null,null,null,null,null,null,null,null,null,null,null,null,null,null,null,null,null,null,null,null,null,"",0,0,0,1,null,null,null,null,null,null,null,null,20,null,null,null,null,"",0,"","",0,null,"",0,null,null,"",0,null,null,"",0,null,null,"",0,null,null,"",0,null,null,"",0,null,null,"",0,null,null,"",0,null,null,"",0,null,null,"",0,null,null,"",0,null,null,"",0,null,null,"",0,null,null,"",0,null,null,"",0,null,null,"",0,null,null,"",0,null,null,"",0,null,null,"",0,null,null,"",0,null,null,"",0,null,null,"",0,null,null,"",0,null,null,"",0]
[null,null,null,null,null,null,null,null,null,null,null,null,null,null,null,null,null,null,null,null,null,null,null,null,null,null,null,null,null,null,null,null,null,null,null,null,null,null,null,null,null,null,null,null,3,{"$f":"IFERROR(IF(AND(OR(AX132=1,AY132=0),OR(AV132<=$AU$7,AV132>$AU$6,AV132-AW132=$AU$7,AV132-AW132=0)),1,LOOKUP(ABS(MAX((AV132-AW132),AY132)),$BB$85:$BB$93,$BG$85:$BG$93)),0)","v":1},1,0,0,{"$f":"IF(OR($AU$6-H27<0,$AU$6-H27=0,H27<=$AU$7,$AU$7-H27=0,2*$AU$7-H27=0,3*$AU$7-H27=0,4*$AU$7-H27=0,5*$AU$7-H27=0,6*$AU$7-H27=0,7*$AU$7-H27=0,8*$AU$7-H27=0,9*$AU$7-H27=0,10*$AU$7-H27=0),1,\"\")","v":1},4,{"$f":"IF($AU$7*AZ$129-$H27<-$AU$7,$AU$7,$AU$7*AZ$129-$H27)","v":4},8,12,16,20,24,28,32,36,40,18,0,0,0,0,0,0,0,0,0,0,0,0,0,0,0,0,0,0,0,0,0,0,0,0,0,0,0,0,0,0,0,0,0,0,0,0,0,null,null,null,null,null,null,null,null,null,null,null,null,null,null,null,null,null,null,null,null,null,null,null,null,null,null,null,null,null,null,null,null,null,null,null,null,null,null,null,null,null,null,"",0,{"$f":"EO132*EP132","v":0},0,1,null,null,null,null,null,null,null,null,21,null,null,null,null,"",0,"","",0,null,"",0,null,null,"",0,null,null,"",0,null,null,"",0,null,null,"",0,null,null,"",0,null,null,"",0,null,null,"",0,null,null,"",0,null,null,"",0,null,null,"",0,null,null,"",0,null,null,"",0,null,null,"",0,null,null,"",0,null,null,"",0,null,null,"",0,null,null,"",0,null,null,"",0,null,null,"",0,null,null,"",0,null,null,"",0,null,null,"",0,null,null,"",0]
[null,null,null,null,null,null,null,null,null,null,null,null,null,null,null,null,null,null,null,null,null,null,null,null,null,null,null,null,null,null,null,null,null,null,null,null,null,null,null,null,null,null,null,null,4,{"$f":"IFERROR(IF(AND(OR(AX133=1,AY133=0),OR(AV133<=$AU$7,AV133>$AU$6,AV133-AW133=$AU$7,AV133-AW133=0)),1,LOOKUP(ABS(MAX((AV133-AW133),AY133)),$BB$85:$BB$93,$BG$85:$BG$93)),0)","v":1},1,0,0,{"$f":"IF(OR($AU$6-H28<0,$AU$6-H28=0,H28<=$AU$7,$AU$7-H28=0,2*$AU$7-H28=0,3*$AU$7-H28=0,4*$AU$7-H28=0,5*$AU$7-H28=0,6*$AU$7-H28=0,7*$AU$7-H28=0,8*$AU$7-H28=0,9*$AU$7-H28=0,10*$AU$7-H28=0),1,\"\")","v":1},4,{"$f":"IF($AU$7*AZ$129-$H28<-$AU$7,$AU$7,$AU$7*AZ$129-$H28)","v":4},8,12,16,20,24,28,32,36,40,19,0,0,0,0,0,0,0,0,0,0,0,0,0,0,0,0,0,0,0,0,0,0,0,0,0,0,0,0,0,0,0,0,0,0,0,0,0,null,null,null,null,null,null,null,null,null,null,null,null,null,null,null,null,null,null,null,null,null,null,null,null,null,null,null,null,null,null,null,null,null,null,null,null,null,null,null,null,null,null,"",0,{"$f":"EO133*EP133","v":0},0,1,null,null,null,null,null,null,null,null,22,null,null,null,null,"",0,"","",0,null,"",0,null,null,"",0,null,null,"",0,null,null,"",0,null,null,"",0,null,null,"",0,null,null,"",0,null,null,"",0,null,null,"",0,null,null,"",0,null,null,"",0,null,null,"",0,null,null,"",0,null,null,"",0,null,null,"",0,null,null,"",0,null,null,"",0,null,null,"",0,null,null,"",0,null,null,"",0,null,null,"",0,null,null,"",0,null,null,"",0,null,null,"",0]
[null,null,null,null,null,null,null,null,null,null,null,null,null,null,null,null,null,null,null,null,null,null,null,null,null,null,null,null,null,null,null,null,null,null,null,null,null,null,null,null,null,null,null,null,5,{"$f":"IFERROR(IF(AND(OR(AX134=1,AY134=0),OR(AV134<=$AU$7,AV134>$AU$6,AV134-AW134=$AU$7,AV134-AW134=0)),1,LOOKUP(ABS(MAX((AV134-AW134),AY134)),$BB$85:$BB$93,$BG$85:$BG$93)),0)","v":1},{"$f":"IF(AND(OR(AX134=1,AY134=0),OR(AV134<=$AU$7,AV134>$AU$6,AV134-AW134=$AU$7,AV134-AW134=0)),1,ABS(MAX((AV134-AW134),AY134)/$AU$7))","v":1},0,0,1,4,{"$f":"IF($AU$7*AZ$129-$H29<-$AU$7,$AU$7,$AU$7*AZ$129-$H29)","v":4},8,12,16,20,24,28,32,36,40,20,0,0,0,0,0,0,0,0,0,0,0,0,0,0,0,0,0,0,0,0,0,0,0,0,0,0,0,0,0,0,0,0,0,0,0,0,0,null,null,null,null,null,null,null,null,null,null,null,null,null,null,null,null,null,null,null,null,null,null,null,null,null,null,null,null,null,null,null,null,null,null,null,null,null,null,null,null,null,null,"",0,{"$f":"EO134*EP134","v":0},0,1,null,null,null,null,null,null,null,null,23,null,null,null,null,"",0,"","",0,null,"",0,null,null,"",0,null,null,"",0,null,null,"",0,null,null,"",0,null,null,"",0,null,null,"",0,null,null,"",0,null,null,"",0,null,null,"",0,null,null,"",0,null,null,"",0,null,null,"",0,null,null,"",0,null,null,"",0,null,null,"",0,null,null,"",0,null,null,"",0,null,null,"",0,null,null,"",0,null,null,"",0,null,null,"",0,null,null,"",0,null,null,"",0]
[null,null,null,null,null,null,null,null,null,null,null,null,null,null,null,null,null,null,null,null,null,null,null,null,null,null,null,null,null,null,null,null,null,null,null,null,null,null,null,null,null,null,null,null,6,1,1,0,0,1,4,{"$f":"IF($AU$7*AZ$129-$H30<-$AU$7,$AU$7,$AU$7*AZ$129-$H30)","v":4},8,12,16,20,24,28,32,36,40,21,0,0,0,0,0,0,0,0,0,0,0,0,0,0,0,0,0,0,0,0,0,0,0,0,0,0,0,0,0,0,0,0,0,0,0,0,0,null,null,null,null,null,null,null,null,null,null,null,null,null,null,null,null,null,null,null,null,null,null,null,null,null,null,null,null,null,null,null,null,null,null,null,null,null,null,null,null,null,null,"",0,{"$f":"EO135*EP135","v":0},0,1,null,null,null,null,null,null,null,null,24,null,null,null,null,"",0,"","",0,null,"",0,null,null,"",0,null,null,"",0,null,null,"",0,null,null,"",0,null,null,"",0,null,null,"",0,null,null,"",0,null,null,"",0,null,null,"",0,null,null,"",0,null,null,"",0,null,null,"",0,null,null,"",0,null,null,"",0,null,null,"",0,null,null,"",0,null,null,"",0,null,null,"",0,null,null,"",0,null,null,"",0,null,null,"",0,null,null,"",0,null,null,"",0]
[null,null,null,null,null,null,null,null,null,null,null,null,null,null,null,null,null,null,null,null,null,null,null,null,null,null,null,null,null,null,null,null,null,null,null,null,null,null,null,null,null,null,null,null,7,1,1,0,0,1,4,{"$f":"IF($AU$7*AZ$129-$H31<-$AU$7,$AU$7,$AU$7*AZ$129-$H31)","v":4},8,12,16,20,24,28,32,36,40,22,0,0,0,0,0,0,0,0,0,0,0,0,0,0,0,0,0,0,0,0,0,0,0,0,0,0,0,0,0,0,0,0,0,0,0,0,0,null,null,null,null,null,null,null,null,null,null,null,null,null,null,null,null,null,null,null,null,null,null,null,null,null,null,null,null,null,null,null,null,null,null,null,null,null,null,null,null,null,null,"",0,{"$f":"EO136*EP136","v":0},0,1,null,null,null,null,null,null,null,null,25,null,null,null,null,"",0,"","",0,null,"",0,null,null,"",0,null,null,"",0,null,null,"",0,null,null,"",0,null,null,"",0,null,null,"",0,null,null,"",0,null,null,"",0,null,null,"",0,null,null,"",0,null,null,"",0,null,null,"",0,null,null,"",0,null,null,"",0,null,null,"",0,null,null,"",0,null,null,"",0,null,null,"",0,null,null,"",0,null,null,"",0,null,null,"",0,null,null,"",0,null,null,"",0]
[null,null,null,null,null,null,null,null,null,null,null,null,null,null,null,null,null,null,null,null,null,null,null,null,null,null,null,null,null,null,null,null,null,null,null,null,null,null,null,null,null,null,null,null,8,1,1,0,0,1,4,{"$f":"IF($AU$7*AZ$129-$H32<-$AU$7,$AU$7,$AU$7*AZ$129-$H32)","v":4},8,12,16,20,24,28,32,36,40,23,{"$f":"IF(BL137=0,0,VLOOKUP(BL137,$AZ$116:$BD$124,5,FALSE))","v":0},0,0,0,0,0,0,0,0,0,0,0,0,0,0,0,0,0,0,0,0,0,0,0,0,0,0,0,0,0,0,0,0,0,0,0,0]
[null,null,null,null,null,null,null,null,null,null,null,null,null,null,null,null,null,null,null,null,null,null,null,null,null,null,null,null,null,null,null,null,null,null,null,null,null,null,null,null,null,null,null,null,9,1,1,0,0,1,4,{"$f":"IF($AU$7*AZ$129-$H33<-$AU$7,$AU$7,$AU$7*AZ$129-$H33)","v":4},8,12,16,20,24,28,32,36,40,24,0,0,0,0,0,0,0,0,0,0,0,0,0,0,0,0,0,0,0,0,0,0,0,0,0,0,0,0,0,0,0,0,0,0,0,0,0,null,null,null,null,null,null,null,null,null,null,null,null,null,null,null,null,null,null,null,null,null,null,null,null,null,null,null,null,null,null,null,null,null,null,null,null,null,null,null,null,null,null,null,null,null,null,null,null,null,null,null,null,null,null,null,null,null,null,null,null,null,"Avaliação das perdas de carga estáticas acumuladas",null,{"$f":"FG22","v":1},null,{"$f":"FG138+1","v":2},null,null,{"$f":"FI138+1","v":3},null,null,null,{"$f":"FL138+1","v":4},null,null,null,{"$f":"FP138+1","v":5},null,null,null,{"$f":"FT138+1","v":6},null,null,null,{"$f":"FX138+1","v":7},null,null,null,{"$f":"GB138+1","v":8},null,null,null,{"$f":"GF138+1","v":9},null,null,null,{"$f":"GJ138+1","v":10},null,null,null,{"$f":"GN138+1","v":11},null,null,null,{"$f":"GR138+1","v":12},null,null,null,{"$f":"GV138+1","v":13},null,null,null,{"$f":"GZ138+1","v":14},null,null,null,{"$f":"HD138+1","v":15},null,null,null,{"$f":"HH138+1","v":16},null,null,null,{"$f":"HL138+1","v":17},null,null,null,{"$f":"HP138+1","v":18},null,null,null,{"$f":"HT138+1","v":19},null,null,null,{"$f":"HX138+1","v":20},null,null,null,{"$f":"IB138+1","v":21},null,null,null,{"$f":"IF138+1","v":22},null,null,null,{"$f":"IJ138+1","v":23},null,null,null,{"$f":"IN138+1","v":24},null,null,null,{"$f":"IR138+1","v":25}]
[null,null,null,null,null,null,null,null,null,null,null,null,null,null,null,null,null,null,null,null,null,null,null,null,null,null,null,null,null,null,null,null,null,null,null,null,null,null,null,null,null,null,null,null,10,1,1,0,0,1,4,{"$f":"IF($AU$7*AZ$129-$H34<-$AU$7,$AU$7,$AU$7*AZ$129-$H34)","v":4},8,12,16,20,24,28,32,36,40,25,0,0,0,0,0,0,0,0,0,0,0,0,0,0,0,0,0,0,0,0,0,0,0,0,0,0,0,0,0,0,0,0,0,0,0,0,0,null,null,null,null,null,null,null,null,null,null,null,null,null,null,null,null,null,null,null,null,null,null,null,null,null,null,null,null,null,null,null,null,null,null,null,null,null,null,null,null,null,null,null,null,null,null,null,null,null,null,null,null,null,null,null,null,null,null,null,"Determinação do Caminho Crítico",null,"ΔPEstát.Total","Nó Inicial","Nó Final","ΔPest","Nó antecedente",null,"ΔP",null,"Nó antecedente",null,"ΔP",null,"Nó antecedente",null,"ΔP",null,"Nó antecedente",null,"ΔP",null,"Nó antecedente",null,"ΔP",null,"Nó antecedente",null,"ΔP",null,"Nó antecedente",null,"ΔP",null,"Nó antecedente",null,"ΔP",null,"Nó antecedente",null,"ΔP",null,"Nó antecedente",null,"ΔP",null,"Nó antecedente",null,"ΔP",null,"Nó antecedente",null,"ΔP",null,"Nó antecedente",null,"ΔP",null,"Nó antecedente",null,"ΔP",null,"Nó antecedente",null,"ΔP",null,"Nó antecedente",null,"ΔP",null,"Nó antecedente",null,"ΔP",null,"Nó antecedente",null,"ΔP",null,"Nó antecedente",null,"ΔP",null,"Nó antecedente",null,"ΔP",null,"Nó antecedente",null,"ΔP",null,"Nó antecedente",null,"ΔP",null,"Nó antecedente",null,"ΔP",null,"Nó antecedente",null,"ΔP"]
[null,null,null,null,null,null,null,null,null,null,null,null,null,null,null,null,null,null,null,null,null,null,null,null,null,null,null,null,null,null,null,null,null,null,null,null,null,null,null,null,null,null,null,null,11,1,1,0,0,1,4,{"$f":"IF($AU$7*AZ$129-$H35<-$AU$7,$AU$7,$AU$7*AZ$129-$H35)","v":4},8,12,16,20,24,28,32,36,40,null,null,null,null,null,null,null,null,null,null,null,null,null,null,{"$f":"IF(MAX(BX115:BX139)=SUM(BX115:BX139),0,IF(MAX(BX115:BX139)>0,MAX(BX115:BX139),0))","v":0},{"$f":"SUM(BY115:BY139)","v":0},null,{"$f":"IF(MAX(CA115:CA139)=SUM(CA115:CA139),0,IF(MAX(CA115:CA139)>0,MAX(CA115:CA139),0))","v":0},{"$f":"SUM(CB115:CB139)","v":0},null,{"$f":"IF(MAX(CD115:CD139)=SUM(CD115:CD139),0,IF(MAX(CD115:CD139)>0,MAX(CD115:CD139),0))","v":0},{"$f":"SUM(CE115:CE139)","v":0},null,{"$f":"IF(MAX(CG115:CG139)=SUM(CG115:CG139),0,IF(MAX(CG115:CG139)>0,MAX(CG115:CG139),0))","v":0},{"$f":"SUM(CH115:CH139)","v":0},null,{"$f":"IF(MAX(CJ115:CJ139)=SUM(CJ115:CJ139),0,IF(MAX(CJ115:CJ139)>0,MAX(CJ115:CJ139),0))","v":0},{"$f":"SUM(CK115:CK139)","v":0},null,{"$f":"IF(MAX(CM115:CM139)=SUM(CM115:CM139),0,IF(MAX(CM115:CM139)>0,MAX(CM115:CM139),0))","v":0},{"$f":"SUM(CN115:CN139)","v":0},null,{"$f":"IF(MAX(CP115:CP139)=SUM(CP115:CP139),0,IF(MAX(CP115:CP139)>0,MAX(CP115:CP139),0))","v":0},{"$f":"SUM(CQ115:CQ139)","v":0},null,{"$f":"IF(MAX(CS115:CS139)=SUM(CS115:CS139),0,IF(MAX(CS115:CS139)>0,MAX(CS115:CS139),0))","v":0},{"$f":"SUM(CT115:CT139)","v":0},null,null,null,null,null,null,null,null,null,null,null,null,null,null,null,null,null,null,null,null,null,null,null,null,null,null,null,null,null,null,null,null,null,null,null,null,null,null,null,null,null,null,null,null,null,null,null,null,null,null,null,null,null,null,null,null,"Nº",null,null,null,"Perda Carda Estática Máx.",null,{"$f":"MAX(FE141:FE165)","v":0},null,null,"kPa",null,null,"kPa",null,null,null,"kPa",null,null,null,"kPa",null,null,null,"kPa",null,null,null,"kPa",null,null,null,"kPa",null,null,null,"kPa",null,null,null,"kPa",null,null,null,"kPa",null,null,null,"kPa",null,null,null,"kPa",null,null,null,"kPa",null,null,null,"kPa",null,null,null,"kPa",null,null,null,"kPa",null,null,null,"kPa",null,null,null,"kPa",null,null,null,"kPa",null,null,null,"kPa",null,null,null,"kPa",null,null,null,"kPa",null,null,null,"kPa",null,null,null,"kPa",null,null,null,"kPa"]
[null,null,null,null,null,null,null,null,null,null,null,null,null,null,null,null,null,null,null,null,null,null,null,null,null,null,null,null,null,null,null,null,null,null,null,null,null,null,null,null,null,null,null,null,12,1,1,0,0,1,4,{"$f":"IF($AU$7*AZ$129-$H36<-$AU$7,$AU$7,$AU$7*AZ$129-$H36)","v":4},8,12,16,20,24,28,32,36,40,null,null,null,null,null,null,null,null,null,null,null,null,null,null,{"$f":"IF(BX140=0,0,IF(BY140>=2,0,MATCH(BX140,BX115:BX139,0)))","v":0},{"$f":"IF(OR(BX140=0,BX141=0),\"\",INDEX(BW115:BW139,BX141))","v":""},null,{"$f":"IF(CA140=0,0,IF(CB140>=2,0,MATCH(CA140,CA115:CA139,0)))","v":0},{"$f":"IF(OR(CA140=0,CA141=0),\"\",INDEX(BZ115:BZ139,CA141))","v":""},null,{"$f":"IF(CD140=0,0,IF(CE140>=2,0,MATCH(CD140,CD115:CD139,0)))","v":0},{"$f":"IF(OR(CD140=0,CD141=0),\"\",INDEX(CC115:CC139,CD141))","v":""},null,{"$f":"IF(CG140=0,0,IF(CH140>=2,0,MATCH(CG140,CG115:CG139,0)))","v":0},{"$f":"IF(OR(CG140=0,CG141=0),\"\",INDEX(CF115:CF139,CG141))","v":""},null,{"$f":"IF(CJ140=0,0,IF(CK140>=2,0,MATCH(CJ140,CJ115:CJ139,0)))","v":0},{"$f":"IF(OR(CJ140=0,CJ141=0),\"\",INDEX(CI115:CI139,CJ141))","v":""},null,{"$f":"IF(CM140=0,0,IF(CN140>=2,0,MATCH(CM140,CM115:CM139,0)))","v":0},{"$f":"IF(OR(CM140=0,CM141=0),\"\",INDEX(CL115:CL139,CM141))","v":""},null,{"$f":"IF(CP140=0,0,IF(CQ140>=2,0,MATCH(CP140,CP115:CP139,0)))","v":0},{"$f":"IF(OR(CP140=0,CP141=0),\"\",INDEX(CO115:CO139,CP141))","v":""},null,{"$f":"IF(CS140=0,0,IF(CT140>=2,0,MATCH(CS140,CS115:CS139,0)))","v":0},{"$f":"IF(OR(CS140=0,CS141=0),\"\",INDEX(CR115:CR139,CS141))","v":""},null,null,null,null,null,null,null,null,null,null,null,null,null,null,null,null,null,null,null,null,null,null,null,null,null,null,null,null,null,null,null,null,null,null,null,null,null,null,null,null,null,null,null,null,null,null,null,null,null,null,null,null,null,null,null,null,1,null,null,null,{"$f":"IF(OR(FE141=\"\",FE141=0),\"\",IF(FE141=$FE$140,\"Crítico\",\"\"))","v":""},{"$f":"IF(FC141=\"\",\"\",1)","v":""},{"$f":"FH141+FK141+FO141+FS141+FW141+GA141+GE141+GI141+GM141+GQ141+GU141+GY141+HC141+HG141+HK141+HO141+HS141+HW141+IA141+IE141+II141+IM141+IQ141+IU141+IY141","v":0},{"$f":"IF(OR(F25=\"\",G25=\"\"),\"\",F25)","v":""},{"$f":"IF(OR(F25=\"\",G25=\"\"),\"\",G25)","v":""},{"$f":"IF(OR($K25=\"\",$K25=0),0,$K25*$AU$19*($B$18))","v":0},null,{"$f":"FJ112","v":""},{"$f":"IF(FJ141=\"\",0,LOOKUP(FJ141,$EY$141:$EY$165,$FH$141:$FH$165))","v":0},null,null,{"$f":"FN112","v":""},{"$f":"IF(FN141=\"\",0,LOOKUP(FN141,$EY$141:$EY$165,$FH$141:$FH$165))","v":0},null,null,{"$f":"FR112","v":""},{"$f":"IF(FR141=\"\",0,LOOKUP(FR141,$EY$141:$EY$165,$FH$141:$FH$165))","v":0},null,null,{"$f":"FV112","v":""},{"$f":"IF(FV141=\"\",0,LOOKUP(FV141,$EY$141:$EY$165,$FH$141:$FH$165))","v":0},null,null,{"$f":"FZ112","v":""},{"$f":"IF(FZ141=\"\",0,LOOKUP(FZ141,$EY$141:$EY$165,$FH$141:$FH$165))","v":0},null,null,{"$f":"GD112","v":""},{"$f":"IF(GD141=\"\",0,LOOKUP(GD141,$EY$141:$EY$165,$FH$141:$FH$165))","v":0},null,null,{"$f":"GH112","v":""},{"$f":"IF(GH141=\"\",0,LOOKUP(GH141,$EY$141:$EY$165,$FH$141:$FH$165))","v":0},null,null,{"$f":"GL112","v":""},{"$f":"IF(GL141=\"\",0,LOOKUP(GL141,$EY$141:$EY$165,$FH$141:$FH$165))","v":0},null,null,{"$f":"GP112","v":""},{"$f":"IF(GP141=\"\",0,LOOKUP(GP141,$EY$141:$EY$165,$FH$141:$FH$165))","v":0},null,null,{"$f":"GT112","v":""},{"$f":"IF(GT141=\"\",0,LOOKUP(GT141,$EY$141:$EY$165,$FH$141:$FH$165))","v":0},null,null,{"$f":"GX112","v":""},{"$f":"IF(GX141=\"\",0,LOOKUP(GX141,$EY$141:$EY$165,$FH$141:$FH$165))","v":0},null,null,{"$f":"HB112","v":""},{"$f":"IF(HB141=\"\",0,LOOKUP(HB141,$EY$141:$EY$165,$FH$141:$FH$165))","v":0},null,null,{"$f":"HF112","v":""},{"$f":"IF(HF141=\"\",0,LOOKUP(HF141,$EY$141:$EY$165,$FH$141:$FH$165))","v":0},null,null,{"$f":"HJ112","v":""},{"$f":"IF(HJ141=\"\",0,LOOKUP(HJ141,$EY$141:$EY$165,$FH$141:$FH$165))","v":0},null,null,{"$f":"HN112","v":""},{"$f":"IF(HN141=\"\",0,LOOKUP(HN141,$EY$141:$EY$165,$FH$141:$FH$165))","v":0},null,null,{"$f":"HR112","v":""},{"$f":"IF(HR141=\"\",0,LOOKUP(HR141,$EY$141:$EY$165,$FH$141:$FH$165))","v":0},null,null,{"$f":"HV112","v":""},{"$f":"IF(HV141=\"\",0,LOOKUP(HV141,$EY$141:$EY$165,$FH$141:$FH$165))","v":0},null,null,{"$f":"HZ112","v":""},{"$f":"IF(HZ141=\"\",0,LOOKUP(HZ141,$EY$141:$EY$165,$FH$141:$FH$165))","v":0},null,null,{"$f":"ID112","v":""},{"$f":"IF(ID141=\"\",0,LOOKUP(ID141,$EY$141:$EY$165,$FH$141:$FH$165))","v":0},null,null,{"$f":"IH112","v":""},{"$f":"IF(IH141=\"\",0,LOOKUP(IH141,$EY$141:$EY$165,$FH$141:$FH$165))","v":0},null,null,{"$f":"IL112","v":""},{"$f":"IF(IL141=\"\",0,LOOKUP(IL141,$EY$141:$EY$165,$FH$141:$FH$165))","v":0},null,null,{"$f":"IP112","v":""},{"$f":"IF(IP141=\"\",0,LOOKUP(IP141,$EY$141:$EY$165,$FH$141:$FH$165))","v":0},null,null,{"$f":"IT112","v":""},{"$f":"IF(IT141=\"\",0,LOOKUP(IT141,$EY$141:$EY$165,$FH$141:$FH$165))","v":0},null,null,{"$f":"IX112","v":""},{"$f":"IF(IX141=\"\",0,LOOKUP(IX141,$EY$141:$EY$165,$FH$141:$FH$165))","v":0}]
[null,null,null,null,null,null,null,null,null,null,null,null,null,null,null,null,null,null,null,null,null,null,null,null,null,null,null,null,null,null,null,null,null,null,null,null,null,null,null,null,null,null,null,null,13,1,1,0,0,1,4,{"$f":"IF($AU$7*AZ$129-$H37<-$AU$7,$AU$7,$AU$7*AZ$129-$H37)","v":4},8,12,16,20,24,28,32,36,40,null,null,null,null,null,null,null,null,null,null,null,null,null,null,null,null,null,null,null,null,null,null,null,null,null,null,null,null,null,null,null,null,null,null,null,null,null,null,null,null,null,null,null,null,null,null,null,null,null,null,null,null,null,null,null,null,null,null,null,null,null,null,null,null,null,null,null,null,null,null,null,null,null,null,null,null,null,null,null,null,null,null,null,null,null,null,null,null,null,null,null,null,null,2,null,null,null,"",{"$f":"IF(FC142=\"\",\"\",1)","v":""},0,"","",0,null,{"$f":"FJ113","v":""},0,null,null,{"$f":"FN113","v":""},0,null,null,{"$f":"FR113","v":""},0,null,null,{"$f":"FV113","v":""},0,null,null,{"$f":"FZ113","v":""},0,null,null,{"$f":"GD113","v":""},0,null,null,{"$f":"GH113","v":""},0,null,null,{"$f":"GL113","v":""},0,null,null,{"$f":"GP113","v":""},0,null,null,{"$f":"GT113","v":""},0,null,null,{"$f":"GX113","v":""},0,null,null,{"$f":"HB113","v":""},0,null,null,{"$f":"HF113","v":""},0,null,null,{"$f":"HJ113","v":""},0,null,null,{"$f":"HN113","v":""},0,null,null,{"$f":"HR113","v":""},0,null,null,{"$f":"HV113","v":""},0,null,null,{"$f":"HZ113","v":""},0,null,null,{"$f":"ID113","v":""},0,null,null,{"$f":"IH113","v":""},0,null,null,{"$f":"IL113","v":""},0,null,null,{"$f":"IP113","v":""},0,null,null,{"$f":"IT113","v":""},0,null,null,{"$f":"IX113","v":""},0]
[null,null,null,null,null,null,null,null,null,null,null,null,null,null,null,null,null,null,null,null,null,null,null,null,null,null,null,null,null,null,null,null,null,null,null,null,null,null,null,null,null,null,null,null,14,1,1,0,0,1,4,{"$f":"IF($AU$7*AZ$129-$H38<-$AU$7,$AU$7,$AU$7*AZ$129-$H38)","v":4},8,12,16,20,24,28,32,36,40,null,null,null,null,null,null,null,null,null,null,null,null,null,null,null,null,null,null,null,null,null,null,null,null,null,null,null,null,null,null,null,null,null,null,null,null,null,null,null,null,null,null,null,null,null,null,null,null,null,null,null,null,null,null,null,null,null,null,null,null,null,null,null,null,null,null,null,null,null,null,null,null,null,null,null,null,null,null,null,null,null,null,null,null,null,null,null,null,null,null,null,null,null,3,null,null,null,"","",0,"","",0,null,"",0,null,null,"",0,null,null,"",0,null,null,"",0,null,null,"",0,null,null,"",0,null,null,"",0,null,null,"",0,null,null,"",0,null,null,"",0,null,null,"",0,null,null,"",0,null,null,"",0,null,null,"",0,null,null,"",0,null,null,"",0,null,null,"",0,null,null,"",0,null,null,"",0,null,null,"",0,null,null,"",0,null,null,"",0,null,null,"",0,null,null,"",0]
[null,null,null,null,null,null,null,null,null,null,null,null,null,null,null,null,null,null,null,null,null,null,null,null,null,null,null,null,null,null,null,null,null,null,null,null,null,null,null,null,null,null,null,null,15,1,1,0,0,1,4,{"$f":"IF($AU$7*AZ$129-$H39<-$AU$7,$AU$7,$AU$7*AZ$129-$H39)","v":4},8,12,16,20,24,28,32,36,40,null,null,null,null,null,null,null,null,null,null,null,null,null,null,null,null,null,null,null,null,null,null,null,null,null,null,null,null,null,null,null,null,null,null,null,null,null,null,null,null,null,null,null,null,null,null,null,null,null,null,null,null,null,null,null,null,null,null,null,null,null,null,null,null,null,null,null,null,null,null,null,null,null,null,null,null,null,null,null,null,null,null,null,null,null,null,null,null,null,null,null,null,null,4,null,null,null,"","",0,"","",0,null,"",0,null,null,"",0,null,null,"",0,null,null,"",0,null,null,"",0,null,null,"",0,null,null,"",0,null,null,"",0,null,null,"",0,null,null,"",0,null,null,"",0,null,null,"",0,null,null,"",0,null,null,"",0,null,null,"",0,null,null,"",0,null,null,"",0,null,null,"",0,null,null,"",0,null,null,"",0,null,null,"",0,null,null,"",0,null,null,"",0,null,null,"",0]
[null,null,null,null,null,null,null,null,null,null,null,null,null,null,null,null,null,null,null,null,null,null,null,null,null,null,null,null,null,null,null,null,null,null,null,null,null,null,null,null,null,null,null,null,16,1,1,0,0,1,4,{"$f":"IF($AU$7*AZ$129-$H40<-$AU$7,$AU$7,$AU$7*AZ$129-$H40)","v":4},8,12,16,20,24,28,32,36,40,null,null,null,null,null,null,null,null,null,null,null,null,null,null,null,null,null,null,null,null,null,null,null,null,null,null,null,null,null,null,null,null,null,null,null,null,null,null,null,null,null,null,null,null,null,null,null,null,null,null,null,null,null,null,null,null,null,null,null,null,null,null,null,null,null,null,null,null,null,null,null,null,null,null,null,null,null,null,null,null,null,null,null,null,null,null,null,null,null,null,null,null,null,5,null,null,null,"","",0,"","",0,null,"",0,null,null,"",0,null,null,"",0,null,null,"",0,null,null,"",0,null,null,"",0,null,null,"",0,null,null,"",0,null,null,"",0,null,null,"",0,null,null,"",0,null,null,"",0,null,null,"",0,null,null,"",0,null,null,"",0,null,null,"",0,null,null,"",0,null,null,"",0,null,null,"",0,null,null,"",0,null,null,"",0,null,null,"",0,null,null,"",0,null,null,"",0]
[null,null,null,null,null,null,null,null,null,null,null,null,null,null,null,null,null,null,null,null,null,null,null,null,null,null,null,null,null,null,null,null,null,null,null,null,null,null,null,null,null,null,null,null,17,1,1,0,0,1,4,{"$f":"IF($AU$7*AZ$129-$H41<-$AU$7,$AU$7,$AU$7*AZ$129-$H41)","v":4},8,12,16,20,24,28,32,36,40,null,null,null,null,null,null,null,null,null,null,null,null,null,null,null,null,null,null,null,null,null,null,null,null,null,null,null,null,null,null,null,null,null,null,null,null,null,null,null,null,null,null,null,null,null,null,null,null,null,null,null,null,null,null,null,null,null,null,null,null,null,null,null,null,null,null,null,null,null,null,null,null,null,null,null,null,null,null,null,null,null,null,null,null,null,null,null,null,null,null,null,null,null,6,null,null,null,"","",0,"","",0,null,"",0,null,null,"",0,null,null,"",0,null,null,"",0,null,null,"",0,null,null,"",0,null,null,"",0,null,null,"",0,null,null,"",0,null,null,"",0,null,null,"",0,null,null,"",0,null,null,"",0,null,null,"",0,null,null,"",0,null,null,"",0,null,null,"",0,null,null,"",0,null,null,"",0,null,null,"",0,null,null,"",0,null,null,"",0,null,null,"",0,null,null,"",0]
[null,null,null,null,null,null,null,null,null,null,null,null,null,null,null,null,null,null,null,null,null,null,null,null,null,null,null,null,null,null,null,null,null,null,null,null,null,null,null,null,null,null,null,null,18,1,1,0,0,1,4,{"$f":"IF($AU$7*AZ$129-$H42<-$AU$7,$AU$7,$AU$7*AZ$129-$H42)","v":4},8,12,16,20,24,28,32,36,40,null,null,null,null,null,null,null,null,null,null,null,null,null,null,null,null,null,null,null,null,null,null,null,null,null,null,null,null,null,null,null,null,null,null,null,null,null,null,null,null,null,null,null,null,null,null,null,null,null,null,null,null,null,null,null,null,null,null,null,null,null,null,null,null,null,null,null,null,null,null,null,null,null,null,null,null,null,null,null,null,null,null,null,null,null,null,null,null,null,null,null,null,null,7,null,null,null,"","",0,"","",0,null,"",0,null,null,"",0,null,null,"",0,null,null,"",0,null,null,"",0,null,null,"",0,null,null,"",0,null,null,"",0,null,null,"",0,null,null,"",0,null,null,"",0,null,null,"",0,null,null,"",0,null,null,"",0,null,null,"",0,null,null,"",0,null,null,"",0,null,null,"",0,null,null,"",0,null,null,"",0,null,null,"",0,null,null,"",0,null,null,"",0,null,null,"",0]
[null,null,null,null,null,null,null,null,null,null,null,null,null,null,null,null,null,null,null,null,null,null,null,null,null,null,null,null,null,null,null,null,null,null,null,null,null,null,null,null,null,null,null,null,19,1,1,0,0,1,4,{"$f":"IF($AU$7*AZ$129-$H43<-$AU$7,$AU$7,$AU$7*AZ$129-$H43)","v":4},8,12,16,20,24,28,32,36,40,null,null,null,null,null,null,null,null,null,null,null,null,null,null,null,null,null,null,null,null,null,null,null,null,null,null,null,null,null,null,null,null,null,null,null,null,null,null,null,null,null,null,null,null,null,null,null,null,null,null,null,null,null,null,null,null,null,null,null,null,null,null,null,null,null,null,null,null,null,null,null,null,null,null,null,null,null,null,null,null,null,null,null,null,null,null,null,null,null,null,null,null,null,8,null,null,null,"","",0,"","",0,null,"",0,null,null,"",0,null,null,"",0,null,null,"",0,null,null,"",0,null,null,"",0,null,null,"",0,null,null,"",0,null,null,"",0,null,null,"",0,null,null,"",0,null,null,"",0,null,null,"",0,null,null,"",0,null,null,"",0,null,null,"",0,null,null,"",0,null,null,"",0,null,null,"",0,null,null,"",0,null,null,"",0,null,null,"",0,null,null,"",0,null,null,"",0]
[null,null,null,null,null,null,null,null,null,null,null,null,null,null,null,null,null,null,null,null,null,null,null,null,null,null,null,null,null,null,null,null,null,null,null,null,null,null,null,null,null,null,null,null,20,1,1,0,0,1,4,{"$f":"IF($AU$7*AZ$129-$H44<-$AU$7,$AU$7,$AU$7*AZ$129-$H44)","v":4},8,12,16,20,24,28,32,36,40,null,null,null,null,null,null,null,null,null,null,null,null,null,null,null,null,null,null,null,null,null,null,null,null,null,null,null,null,null,null,null,null,null,null,null,null,null,null,null,null,null,null,null,null,null,null,null,null,null,null,null,null,null,null,null,null,null,null,null,null,null,null,null,null,null,null,null,null,null,null,null,null,null,null,null,null,null,null,null,null,null,null,null,null,null,null,null,null,null,null,null,null,null,9,null,null,null,"","",0,"","",0,null,"",0,null,null,"",0,null,null,"",0,null,null,"",0,null,null,"",0,null,null,"",0,null,null,"",0,null,null,"",0,null,null,"",0,null,null,"",0,null,null,"",0,null,null,"",0,null,null,"",0,null,null,"",0,null,null,"",0,null,null,"",0,null,null,"",0,null,null,"",0,null,null,"",0,null,null,"",0,null,null,"",0,null,null,"",0,null,null,"",0,null,null,"",0]
[null,null,null,null,null,null,null,null,null,null,null,null,null,null,null,null,null,null,null,null,null,null,null,null,null,null,null,null,null,null,null,null,null,null,null,null,null,null,null,null,null,null,null,null,21,1,1,0,0,1,4,{"$f":"IF($AU$7*AZ$129-$H45<-$AU$7,$AU$7,$AU$7*AZ$129-$H45)","v":4},8,12,16,20,24,28,32,36,40,null,null,null,null,null,null,null,null,null,null,null,null,null,null,null,null,null,null,null,null,null,null,null,null,null,null,null,null,null,null,null,null,null,null,null,null,null,null,null,null,null,null,null,null,null,null,null,null,null,null,null,null,null,null,null,null,null,null,null,null,null,null,null,null,null,null,null,null,null,null,null,null,null,null,null,null,null,null,null,null,null,null,null,null,null,null,null,null,null,null,null,null,null,10,null,null,null,"","",0,"","",0,null,"",0,null,null,"",0,null,null,"",0,null,null,"",0,null,null,"",0,null,null,"",0,null,null,"",0,null,null,"",0,null,null,"",0,null,null,"",0,null,null,"",0,null,null,"",0,null,null,"",0,null,null,"",0,null,null,"",0,null,null,"",0,null,null,"",0,null,null,"",0,null,null,"",0,null,null,"",0,null,null,"",0,null,null,"",0,null,null,"",0,null,null,"",0]
[null,null,null,null,null,null,null,null,null,null,null,null,null,null,null,null,null,null,null,null,null,null,null,null,null,null,null,null,null,null,null,null,null,null,null,null,null,null,null,null,null,null,null,null,22,1,1,0,0,1,4,{"$f":"IF($AU$7*AZ$129-$H46<-$AU$7,$AU$7,$AU$7*AZ$129-$H46)","v":4},8,12,16,20,24,28,32,36,40,null,null,null,null,null,null,null,null,null,null,null,null,null,null,null,null,null,null,null,null,null,null,null,null,null,null,null,null,null,null,null,null,null,null,null,null,null,null,null,null,null,null,null,null,null,null,null,null,null,null,null,null,null,null,null,null,null,null,null,null,null,null,null,null,null,null,null,null,null,null,null,null,null,null,null,null,null,null,null,null,null,null,null,null,null,null,null,null,null,null,null,null,null,11,null,null,null,"","",0,"","",0,null,"",0,null,null,"",0,null,null,"",0,null,null,"",0,null,null,"",0,null,null,"",0,null,null,"",0,null,null,"",0,null,null,"",0,null,null,"",0,null,null,"",0,null,null,"",0,null,null,"",0,null,null,"",0,null,null,"",0,null,null,"",0,null,null,"",0,null,null,"",0,null,null,"",0,null,null,"",0,null,null,"",0,null,null,"",0,null,null,"",0,null,null,"",0]
[null,null,null,null,null,null,null,null,null,null,null,null,null,null,null,null,null,null,null,null,null,null,null,null,null,null,null,null,null,null,null,null,null,null,null,null,null,null,null,null,null,null,null,null,23,1,1,0,0,1,4,{"$f":"IF($AU$7*AZ$129-$H47<-$AU$7,$AU$7,$AU$7*AZ$129-$H47)","v":4},8,12,16,20,24,28,32,36,40,null,null,null,null,null,null,null,null,null,null,null,null,null,null,null,null,null,null,null,null,null,null,null,null,null,null,null,null,null,null,null,null,null,null,null,null,null,null,null,null,null,null,null,null,null,null,null,null,null,null,null,null,null,null,null,null,null,null,null,null,null,null,null,null,null,null,null,null,null,null,null,null,null,null,null,null,null,null,null,null,null,null,null,null,null,null,null,null,null,null,null,null,null,12,null,null,null,"","",0,"","",0,null,"",0,null,null,"",0,null,null,"",0,null,null,"",0,null,null,"",0,null,null,"",0,null,null,"",0,null,null,"",0,null,null,"",0,null,null,"",0,null,null,"",0,null,null,"",0,null,null,"",0,null,null,"",0,null,null,"",0,null,null,"",0,null,null,"",0,null,null,"",0,null,null,"",0,null,null,"",0,null,null,"",0,null,null,"",0,null,null,"",0,null,null,"",0]
[null,null,null,null,null,null,null,null,null,null,null,null,null,null,null,null,null,null,null,null,null,null,null,null,null,null,null,null,null,null,null,null,null,null,null,null,null,null,null,null,null,null,null,null,24,1,1,0,0,1,4,{"$f":"IF($AU$7*AZ$129-$H48<-$AU$7,$AU$7,$AU$7*AZ$129-$H48)","v":4},8,12,16,20,24,28,32,36,40,null,null,null,null,null,null,null,null,null,null,null,null,null,null,null,null,null,null,null,null,null,null,null,null,null,null,null,null,null,null,null,null,null,null,null,null,null,null,null,null,null,null,null,null,null,null,null,null,null,null,null,null,null,null,null,null,null,null,null,null,null,null,null,null,null,null,null,null,null,null,null,null,null,null,null,null,null,null,null,null,null,null,null,null,null,null,null,null,null,null,null,null,null,13,null,null,null,"","",0,"","",0,null,"",0,null,null,"",0,null,null,"",0,null,null,"",0,null,null,"",0,null,null,"",0,null,null,"",0,null,null,"",0,null,null,"",0,null,null,"",0,null,null,"",0,null,null,"",0,null,null,"",0,null,null,"",0,null,null,"",0,null,null,"",0,null,null,"",0,null,null,"",0,null,null,"",0,null,null,"",0,null,null,"",0,null,null,"",0,null,null,"",0,null,null,"",0]
[null,null,null,null,null,null,null,null,null,null,null,null,null,null,null,null,null,null,null,null,null,null,null,null,null,null,null,null,null,null,null,null,null,null,null,null,null,null,null,null,null,null,null,null,25,1,1,0,0,1,4,{"$f":"IF($AU$7*AZ$129-$H49<-$AU$7,$AU$7,$AU$7*AZ$129-$H49)","v":4},8,12,16,20,24,28,32,36,40,null,null,null,null,null,null,null,null,null,null,null,null,null,null,null,null,null,null,null,null,null,null,null,null,null,null,null,null,null,null,null,null,null,null,null,null,null,null,null,null,null,null,null,null,null,null,null,null,null,null,null,null,null,null,null,null,null,null,null,null,null,null,null,null,null,null,null,null,null,null,null,null,null,null,null,null,null,null,null,null,null,null,null,null,null,null,null,null,null,null,null,null,null,14,null,null,null,"","",0,"","",0,null,"",0,null,null,"",0,null,null,"",0,null,null,"",0,null,null,"",0,null,null,"",0,null,null,"",0,null,null,"",0,null,null,"",0,null,null,"",0,null,null,"",0,null,null,"",0,null,null,"",0,null,null,"",0,null,null,"",0,null,null,"",0,null,null,"",0,null,null,"",0,null,null,"",0,null,null,"",0,null,null,"",0,null,null,"",0,null,null,"",0,null,null,"",0]
[null,null,null,null,null,null,null,null,null,null,null,null,null,null,null,null,null,null,null,null,null,null,null,null,null,null,null,null,null,null,null,null,null,null,null,null,null,null,null,null,null,null,null,null,null,null,null,null,null,null,null,null,null,null,null,null,null,null,null,null,null,null,null,null,null,null,null,null,null,null,null,null,null,null,null,null,null,null,null,null,null,null,null,null,null,null,null,null,null,null,null,null,null,null,null,null,null,null,null,null,null,null,null,null,null,null,null,null,null,null,null,null,null,null,null,null,null,null,null,null,null,null,null,null,null,null,null,null,null,null,null,null,null,null,null,null,null,null,null,null,null,null,null,null,null,null,null,null,null,null,null,null,null,null,15,null,null,null,"","",0,"","",0,null,"",0,null,null,"",0,null,null,"",0,null,null,"",0,null,null,"",0,null,null,"",0,null,null,"",0,null,null,"",0,null,null,"",0,null,null,"",0,null,null,"",0,null,null,"",0,null,null,"",0,null,null,"",0,null,null,"",0,null,null,"",0,null,null,"",0,null,null,"",0,null,null,"",0,null,null,"",0,null,null,"",0,null,null,"",0,null,null,"",0,null,null,"",0]
[null,null,null,null,null,null,null,null,null,null,null,null,null,null,null,null,null,null,null,null,null,null,null,null,null,null,null,null,null,null,null,null,null,null,null,null,null,null,null,null,null,null,null,null,null,null,null,null,null,null,null,null,null,null,null,null,null,null,null,null,null,null,null,null,null,null,null,null,null,null,null,null,null,null,null,null,null,null,null,null,null,null,null,null,null,null,null,null,null,null,null,null,null,null,null,null,null,null,null,null,null,null,null,null,null,null,null,null,null,null,null,null,null,null,null,null,null,null,null,null,null,null,null,null,null,null,null,null,null,null,null,null,null,null,null,null,null,null,null,null,null,null,null,null,null,null,null,null,null,null,null,null,null,null,16,null,null,null,"","",0,"","",0,null,"",0,null,null,"",0,null,null,"",0,null,null,"",0,null,null,"",0,null,null,"",0,null,null,"",0,null,null,"",0,null,null,"",0,null,null,"",0,null,null,"",0,null,null,"",0,null,null,"",0,null,null,"",0,null,null,"",0,null,null,"",0,null,null,"",0,null,null,"",0,null,null,"",0,null,null,"",0,null,null,"",0,null,null,"",0,null,null,"",0,null,null,"",0]
[null,null,null,null,null,null,null,null,null,null,null,null,null,null,null,null,null,null,null,null,null,null,null,null,null,null,null,null,null,null,null,null,null,null,null,null,null,null,null,null,null,null,null,null,null,null,null,null,null,null,null,null,null,null,null,null,null,null,null,null,null,null,null,null,null,null,null,null,null,null,null,null,null,null,null,null,null,null,null,null,null,null,null,null,null,null,null,null,null,null,null,null,null,null,null,null,null,null,null,null,null,null,null,null,null,null,null,null,null,null,null,null,null,null,null,null,null,null,null,null,null,null,null,null,null,null,null,null,null,null,null,null,null,null,null,null,null,null,null,null,null,null,null,null,null,null,null,null,null,null,null,null,null,null,17,null,null,null,"","",0,"","",0,null,"",0,null,null,"",0,null,null,"",0,null,null,"",0,null,null,"",0,null,null,"",0,null,null,"",0,null,null,"",0,null,null,"",0,null,null,"",0,null,null,"",0,null,null,"",0,null,null,"",0,null,null,"",0,null,null,"",0,null,null,"",0,null,null,"",0,null,null,"",0,null,null,"",0,null,null,"",0,null,null,"",0,null,null,"",0,null,null,"",0,null,null,"",0]
[null,null,null,null,null,null,null,null,null,null,null,null,null,null,null,null,null,null,null,null,null,null,null,null,null,null,null,null,null,null,null,null,null,null,null,null,null,null,null,null,null,null,null,null,null,null,null,null,null,null,null,null,null,null,null,null,null,null,null,null,null,null,null,null,null,null,null,null,null,null,null,null,null,null,null,null,null,null,null,null,null,null,null,null,null,null,null,null,null,null,null,null,null,null,null,null,null,null,null,null,null,null,null,null,null,null,null,null,null,null,null,null,null,null,null,null,null,null,null,null,null,null,null,null,null,null,null,null,null,null,null,null,null,null,null,null,null,null,null,null,null,null,null,null,null,null,null,null,null,null,null,null,null,null,18,null,null,null,"","",0,"","",0,null,"",0,null,null,"",0,null,null,"",0,null,null,"",0,null,null,"",0,null,null,"",0,null,null,"",0,null,null,"",0,null,null,"",0,null,null,"",0,null,null,"",0,null,null,"",0,null,null,"",0,null,null,"",0,null,null,"",0,null,null,"",0,null,null,"",0,null,null,"",0,null,null,"",0,null,null,"",0,null,null,"",0,null,null,"",0,null,null,"",0,null,null,"",0]
[null,null,null,null,null,null,null,null,null,null,null,null,null,null,null,null,null,null,null,null,null,null,null,null,null,null,null,null,null,null,null,null,null,null,null,null,null,null,null,null,null,null,null,null,null,null,null,null,null,null,null,null,null,null,null,null,null,null,null,null,null,null,null,null,null,null,null,null,null,null,null,null,null,null,null,null,null,null,null,null,null,null,null,null,null,null,null,null,null,null,null,null,null,null,null,null,null,null,null,null,null,null,null,null,null,null,null,null,null,null,null,null,null,null,null,null,null,null,null,null,null,null,null,null,null,null,null,null,null,null,null,null,null,null,null,null,null,null,null,null,null,null,null,null,null,null,null,null,null,null,null,null,null,null,19,null,null,null,"","",0,"","",0,null,"",0,null,null,"",0,null,null,"",0,null,null,"",0,null,null,"",0,null,null,"",0,null,null,"",0,null,null,"",0,null,null,"",0,null,null,"",0,null,null,"",0,null,null,"",0,null,null,"",0,null,null,"",0,null,null,"",0,null,null,"",0,null,null,"",0,null,null,"",0,null,null,"",0,null,null,"",0,null,null,"",0,null,null,"",0,null,null,"",0,null,null,"",0]
[null,null,null,null,null,null,null,null,null,null,null,null,null,null,null,null,null,null,null,null,null,null,null,null,null,null,null,null,null,null,null,null,null,null,null,null,null,null,null,null,null,null,null,null,null,null,null,null,null,null,null,null,null,null,null,null,null,null,null,null,null,null,null,null,null,null,null,null,null,null,null,null,null,null,null,null,null,null,null,null,null,null,null,null,null,null,null,null,null,null,null,null,null,null,null,null,null,null,null,null,null,null,null,null,null,null,null,null,null,null,null,null,null,null,null,null,null,null,null,null,null,null,null,null,null,null,null,null,null,null,null,null,null,null,null,null,null,null,null,null,null,null,null,null,null,null,null,null,null,null,null,null,null,null,20,null,null,null,"","",0,"","",0,null,"",0,null,null,"",0,null,null,"",0,null,null,"",0,null,null,"",0,null,null,"",0,null,null,"",0,null,null,"",0,null,null,"",0,null,null,"",0,null,null,"",0,null,null,"",0,null,null,"",0,null,null,"",0,null,null,"",0,null,null,"",0,null,null,"",0,null,null,"",0,null,null,"",0,null,null,"",0,null,null,"",0,null,null,"",0,null,null,"",0,null,null,"",0]
[null,null,null,null,null,null,null,null,null,null,null,null,null,null,null,null,null,null,null,null,null,null,null,null,null,null,null,null,null,null,null,null,null,null,null,null,null,null,null,null,null,null,null,null,null,null,null,null,null,null,null,null,null,null,null,null,null,null,null,null,null,null,null,null,null,null,null,null,null,null,null,null,null,null,null,null,null,null,null,null,null,null,null,null,null,null,null,null,null,null,null,null,null,null,null,null,null,null,null,null,null,null,null,null,null,null,null,null,null,null,null,null,null,null,null,null,null,null,null,null,null,null,null,null,null,null,null,null,null,null,null,null,null,null,null,null,null,null,null,null,null,null,null,null,null,null,null,null,null,null,null,null,null,null,21,null,null,null,"","",0,"","",0,null,"",0,null,null,"",0,null,null,"",0,null,null,"",0,null,null,"",0,null,null,"",0,null,null,"",0,null,null,"",0,null,null,"",0,null,null,"",0,null,null,"",0,null,null,"",0,null,null,"",0,null,null,"",0,null,null,"",0,null,null,"",0,null,null,"",0,null,null,"",0,null,null,"",0,null,null,"",0,null,null,"",0,null,null,"",0,null,null,"",0,null,null,"",0]
[null,null,null,null,null,null,null,null,null,null,null,null,null,null,null,null,null,null,null,null,null,null,null,null,null,null,null,null,null,null,null,null,null,null,null,null,null,null,null,null,null,null,null,null,null,null,null,null,null,null,null,null,null,null,null,null,null,null,null,null,null,null,null,null,null,null,null,null,null,null,null,null,null,null,null,null,null,null,null,null,null,null,null,null,null,null,null,null,null,null,null,null,null,null,null,null,null,null,null,null,null,null,null,null,null,null,null,null,null,null,null,null,null,null,null,null,null,null,null,null,null,null,null,null,null,null,null,null,null,null,null,null,null,null,null,null,null,null,null,null,null,null,null,null,null,null,null,null,null,null,null,null,null,null,22,null,null,null,"","",0,"","",0,null,"",0,null,null,"",0,null,null,"",0,null,null,"",0,null,null,"",0,null,null,"",0,null,null,"",0,null,null,"",0,null,null,"",0,null,null,"",0,null,null,"",0,null,null,"",0,null,null,"",0,null,null,"",0,null,null,"",0,null,null,"",0,null,null,"",0,null,null,"",0,null,null,"",0,null,null,"",0,null,null,"",0,null,null,"",0,null,null,"",0,null,null,"",0]
[null,null,null,null,null,null,null,null,null,null,null,null,null,null,null,null,null,null,null,null,null,null,null,null,null,null,null,null,null,null,null,null,null,null,null,null,null,null,null,null,null,null,null,null,null,null,null,null,null,null,null,null,null,null,null,null,null,null,null,null,null,null,null,null,null,null,null,null,null,null,null,null,null,null,null,null,null,null,null,null,null,null,null,null,null,null,null,null,null,null,null,null,null,null,null,null,null,null,null,null,null,null,null,null,null,null,null,null,null,null,null,null,null,null,null,null,null,null,null,null,null,null,null,null,null,null,null,null,null,null,null,null,null,null,null,null,null,null,null,null,null,null,null,null,null,null,null,null,null,null,null,null,null,null,23,null,null,null,"","",0,"","",0,null,"",0,null,null,"",0,null,null,"",0,null,null,"",0,null,null,"",0,null,null,"",0,null,null,"",0,null,null,"",0,null,null,"",0,null,null,"",0,null,null,"",0,null,null,"",0,null,null,"",0,null,null,"",0,null,null,"",0,null,null,"",0,null,null,"",0,null,null,"",0,null,null,"",0,null,null,"",0,null,null,"",0,null,null,"",0,null,null,"",0,null,null,"",0]
[null,null,null,null,null,null,null,null,null,null,null,null,null,null,null,null,null,null,null,null,null,null,null,null,null,null,null,null,null,null,null,null,null,null,null,null,null,null,null,null,null,null,null,null,null,null,null,null,null,null,null,null,null,null,null,null,null,null,null,null,null,null,null,null,null,null,null,null,null,null,null,null,null,null,null,null,null,null,null,null,null,null,null,null,null,null,null,null,null,null,null,null,null,null,null,null,null,null,null,null,null,null,null,null,null,null,null,null,null,null,null,null,null,null,null,null,null,null,null,null,null,null,null,null,null,null,null,null,null,null,null,null,null,null,null,null,null,null,null,null,null,null,null,null,null,null,null,null,null,null,null,null,null,null,24,null,null,null,"","",0,"","",0,null,"",0,null,null,"",0,null,null,"",0,null,null,"",0,null,null,"",0,null,null,"",0,null,null,"",0,null,null,"",0,null,null,"",0,null,null,"",0,null,null,"",0,null,null,"",0,null,null,"",0,null,null,"",0,null,null,"",0,null,null,"",0,null,null,"",0,null,null,"",0,null,null,"",0,null,null,"",0,null,null,"",0,null,null,"",0,null,null,"",0,null,null,"",0]
[null,null,null,null,null,null,null,null,null,null,null,null,null,null,null,null,null,null,null,null,null,null,null,null,null,null,null,null,null,null,null,null,null,null,null,null,null,null,null,null,null,null,null,null,null,null,null,null,null,null,null,null,null,null,null,null,null,null,null,null,null,null,null,null,null,null,null,null,null,null,null,null,null,null,null,null,null,null,null,null,null,null,null,null,null,null,null,null,null,null,null,null,null,null,null,null,null,null,null,null,null,null,null,null,null,null,null,null,null,null,null,null,null,null,null,null,null,null,null,null,null,null,null,null,null,null,null,null,null,null,null,null,null,null,null,null,null,null,null,null,null,null,null,null,null,null,null,null,null,null,null,null,null,null,25,null,null,null,"","",0,"","",0,null,"",0,null,null,"",0,null,null,"",0,null,null,"",0,null,null,"",0,null,null,"",0,null,null,"",0,null,null,"",0,null,null,"",0,null,null,"",0,null,null,"",0,null,null,"",0,null,null,"",0,null,null,"",0,null,null,"",0,null,null,"",0,null,null,"",0,null,null,"",0,null,null,"",0,null,null,"",0,null,null,"",0,null,null,"",0,null,null,"",0,null,null,"",0]
[null,null,null,null,null,null,null,null,null,null,null,null,null,null,null,null,null,null,null,null,null,null,null,null,null,null,null,null,null,null,null,null,null,null,null,null,null,null,null,null,null,null,null,null,null,null,null,null,null,null,null,null,null,null,null,null,null,null,null,null,null,null,null,null,null,null,null,null,null,null,null,null,null,null,null,null,null,null,null,null,null,null,null,null,null,null,null,null,null,null,null,null,null,null,null,null,null,null,null,null,null,null,null,null,null,null,null,null,null,null,null,null,null,null,null,null,null,null,null,null,null,null,null,null,null,null,null,null,null,null,null,null,null,null,null,null,null,null,null,null,null,null,null,null,null,null,null,null,null,null,null,"Atenção: baseado em caudais NOMINAIS."]
[null,null,null,null,null,null,null,null,null,null,null,null,null,null,null,null,null,null,null,null,null,null,null,null,null,null,null,null,null,null,null,null,null,null,null,null,null,null,null,null,null,null,null,null,null,null,null,null,null,null,null,null,null,null,null,null,null,null,null,null,null,null,null,null,null,null,null,null,null,null,null,null,null,null,null,null,null,null,null,null,null,null,null,null,null,null,null,null,null,null,null,null,null,null,null,null,null,null,null,null,null,null,null,null,null,null,null,null,null,null,null,null,null,null,null,null,null,null,null,null,null,null,null,null,null,"Curva mais crítica (com apenas 1 Sprinkler em simultâneo)",null,"Δest","h1)","ΔP","Leq","J","V ","Di","Qtroço",null,null,null,null,null,null,null,"Nominal (baseado em caudais NOMINAIS)",null,null,null,null,null,{"$f":"DS9","v":""},"Localização",null,"Trajecto Crítico-Perda de carga total",null,null,null,null,null,null,null,null,"Avaliação das perdas de carga dinâmicas minímas acumuladas (atenção: baseadas em caudais NOMINAIS) ",null,{"$f":"FG51","v":1},null,{"$f":"FG167+1","v":2},null,null,{"$f":"FI167+1","v":3},null,null,null,{"$f":"FL167+1","v":4},null,null,null,{"$f":"FP167+1","v":5},null,null,null,{"$f":"FT167+1","v":6},null,null,null,{"$f":"FX167+1","v":7},null,null,null,{"$f":"GB167+1","v":8},null,null,null,{"$f":"GF167+1","v":9},null,null,null,{"$f":"GJ167+1","v":10},null,null,null,{"$f":"GN167+1","v":11},null,null,null,{"$f":"GR167+1","v":12},null,null,null,{"$f":"GV167+1","v":13},null,null,null,{"$f":"GZ167+1","v":14},null,null,null,{"$f":"HD167+1","v":15},null,null,null,{"$f":"HH167+1","v":16},null,null,null,{"$f":"HL167+1","v":17},null,null,null,{"$f":"HP167+1","v":18},null,null,null,{"$f":"HT167+1","v":19},null,null,null,{"$f":"HX167+1","v":20},null,null,null,{"$f":"IB167+1","v":21},null,null,null,{"$f":"IF167+1","v":22},null,null,null,{"$f":"IJ167+1","v":23},null,null,null,{"$f":"IN167+1","v":24},null,null,null,{"$f":"IR167+1","v":25}]
[null,null,null,null,null,null,null,null,null,null,null,null,null,null,null,null,null,null,null,null,null,null,null,null,null,null,null,null,null,null,null,null,null,null,null,null,null,null,null,null,null,null,null,null,null,null,null,null,null,null,null,null,null,null,null,null,null,null,null,null,null,null,null,null,null,null,null,null,null,null,null,null,null,null,null,null,null,null,null,null,null,null,null,null,null,null,null,null,null,null,null,null,null,null,null,null,null,null,null,null,null,null,null,null,null,null,null,null,null,null,null,null,null,null,null,null,null,null,null,null,null,null,null,null,null,"Pi máx.","Pmín. B.I.",null,null,null,null,null,null,null,null,"Identificação",null,null,null,null,null,null,"Qtroço","Di cálculo","Dinterior","Di",null,{"$f":"IF(AND(MAX(ES170:ES194)<>1,MAX(ES170:ES194)<>2,MAX(ES170:ES194)<>3,MAX(ES170:ES194)<>4),\"\",MATCH(1,ES170:ES194,0))","v":1},{"$f":"IF(OR(ER168=\"\",ER168=0),\"\",LOOKUP(ER168,EY170:EY194,FG170:FG194))","v":""},"de Extremos",null,"Estática+Dinâmica",null,null,null,"Estática+Dinâmica",null,null,"Determinação do Caminho Crítico",null,"ΔPAcum.Total","Nó Inicial","Nó Final","ΔDin.Min.","Nó antecedente",null,"ΔDin.Min.",null,"Nó antecedente",null,"ΔDin.Min.",null,"Nó antecedente",null,"ΔDin.Min.",null,"Nó antecedente",null,"ΔDin.Min.",null,"Nó antecedente",null,"ΔDin.Min.",null,"Nó antecedente",null,"ΔDin.Min.",null,"Nó antecedente",null,"ΔDin.Min.",null,"Nó antecedente",null,"ΔDin.Min.",null,"Nó antecedente",null,"ΔDin.Min.",null,"Nó antecedente",null,"ΔDin.Min.",null,"Nó antecedente",null,"ΔDin.Min.",null,"Nó antecedente",null,"ΔDin.Min.",null,"Nó antecedente",null,"ΔDin.Min.",null,"Nó antecedente",null,"ΔDin.Min.",null,"Nó antecedente",null,"ΔDin.Min.",null,"Nó antecedente",null,"ΔDin.Min.",null,"Nó antecedente",null,"ΔDin.Min.",null,"Nó antecedente",null,"ΔDin.Min.",null,"Nó antecedente",null,"ΔDin.Min.",null,"Nó antecedente",null,"ΔDin.Min.",null,"Nó antecedente",null,"ΔDin.Min.",null,"Nó antecedente",null,"ΔDin.Min.",null,"Nó antecedente",null,"ΔDin.Min.",null,"Nó antecedente",null,"ΔDin.Min."]
[null,null,null,null,null,null,null,null,null,null,null,null,null,null,null,null,null,null,null,null,null,null,null,null,null,null,null,null,null,null,null,null,null,null,null,null,null,null,null,null,null,null,null,null,null,null,null,null,null,null,null,null,null,null,null,null,null,null,null,null,null,null,null,null,null,null,null,null,null,null,null,null,null,null,null,null,null,null,null,null,null,null,null,null,null,null,null,null,null,null,null,null,null,null,null,null,null,null,null,null,null,null,null,null,null,null,null,null,null,null,null,null,null,null,null,null,null,null,null,null,null,null,null,null,null,{"$f":"DW169+DX169+DZ169","v":56.25},{"$f":"AU9","v":56.25},{"$f":"SUM(DX170:DX194)","v":0},19.75,{"$f":"SUM(DZ170:DZ194)","v":0},null,null,null,null,null,"Troço crítico",null,null,null,null,null,null,"l/min","mm","escolhido","mm",null,"Critério Final",null,"da Instalação",null,"1º Critério",null,{"$f":"MAX(EX170:EX194)","v":0},"Nº","2º Critério",null,{"$f":"MAX(FB170:FB194)","v":0},"Perda Carda Dinâmica Máx.",null,{"$f":"MAX(FE170:FE194)","v":0},null,null,"kPa",null,null,"kPa",null,null,null,"kPa",null,null,null,"kPa",null,null,null,"kPa",null,null,null,"kPa",null,null,null,"kPa",null,null,null,"kPa",null,null,null,"kPa",null,null,null,"kPa",null,null,null,"kPa",null,null,null,"kPa",null,null,null,"kPa",null,null,null,"kPa",null,null,null,"kPa",null,null,null,"kPa",null,null,null,"kPa",null,null,null,"kPa",null,null,null,"kPa",null,null,null,"kPa",null,null,null,"kPa",null,null,null,"kPa",null,null,null,"kPa",null,null,null,"kPa",null,null,null,"kPa"]
[null,null,null,null,null,null,null,null,null,null,null,null,null,null,null,null,null,null,null,null,null,null,null,null,null,null,null,null,null,null,null,null,null,null,null,null,null,null,null,null,null,null,null,null,null,null,null,null,null,null,null,null,null,null,null,null,null,null,null,null,null,null,null,null,null,null,null,null,null,null,null,null,null,null,null,null,null,null,null,null,null,null,null,null,null,null,null,null,null,null,null,null,null,null,null,null,null,null,null,null,null,null,null,null,null,null,null,null,null,null,null,null,null,null,null,null,null,null,null,null,null,null,null,null,null,null,null,{"$f":"IF(EF170=\"c\",DY170*$AU$19/$BK$11,\"\")","v":""},{"$f":"IF(EF170=\"c\",K25,\"\")","v":""},{"$f":"IF(EF170=\"c\",EA170*EB170,\"\")","v":""},{"$f":"IF(EF170=\"c\",M25,\"\")","v":""},{"$f":"IF(OR($P$16=\"\",EE170=\"\",EC170=\"\",ED170=\"\"),\"\",IF($M$15=\"\",$B$18*$AU$19*61.7*100000*((EE170/$B$17)^1.85/($P$16^1.85*ED170^4.87)),$B$18*$AU$19*((4*$P$16*((EC170^7)/(ED170/1000))^(1/4))/(ED170/1000))))","v":""},{"$f":"IF(OR(EE170=\"\",ED170=\"\"),\"\",(66.7*EE170/$B$17)/(PI()*ED170^2))","v":""},{"$f":"W25","v":""},{"$f":"IF(EF170=\"c\",MIN($R$25:$R$49),\"\")","v":""},{"$f":"DO25","v":""},1,{"$f":"DQ25","v":""},"",null,null,null,{"$f":"IF(OR($AU$8=\"\",H25=\"\"),\"\",$AU$8*H25)","v":""},{"$f":"IF(OR(EM170=\"\",M25=\"\",$FD$20=\"\",$FD$20=0),\"\",IF($M$15=\"\",ROUND((61.7*100000*((EM170/$B$17)^1.85/($P$16^1.85*$FD$20)))^(1/4.87),1),ROUND(((4^11*$P$16^4*((EM170/$B$17/60)*0.001)^7)/(PI()^7*$FD$20^4))^(1/19)*1000,1)))","v":""},{"$f":"IF(E25=\"\",\"\",IF(AND($U25<>\"\",D25=\"\",F25<>$EV$53),$U25,IF(AND($A$5>=1,$A$5<=7,MAX($CW25:$CY25)=0),EN170,IF(AND($A$5>=1,$A$5<=7),MAX($CW25:$CY25),IF(AND($A$5>=11,$A$5<=18),MAX($CT55:$CV55),IF($A$5=8,$CT25,IF($A$5=9,$CU25,IF($A$5=10,$CV25,EN170))))))))","v":""},{"$f":"IF(OR(EN170=\"\",EN170=0),\"\",IF($EO170>'Quadro 1'!$G$23,'Quadro 1'!$G$23,IF($EO170<'Quadro 1'!$G$10,'Quadro 1'!$G$10,EO170)))","v":""},null,{"$f":"IF(AND(EV170=\"Crítico\",$EW$195<>0),\"Crítico\",IF(AND(EV170=\"\",$EW$195>=1),\"\",IF(AND(EZ170=\"Crítico\",$FA$195<>0),\"Crítico\",EX25)))","v":"Crítico"},{"$f":"IF(ER170=\"\",\"\",1)","v":1},{"$f":"IF(OR(DT25=\"\",DT25=0),\"\",COUNTIF($DT$25:$ER$49,DT25))","v":""},{"$f":"IF(OR(ET170=\"\",ET170>1),0,ET170)","v":0},{"$f":"IF(OR(EX170=\"\",EX170=0,M25=\"\"),\"\",IF(EX170=$EX$169,\"Crítico\",\"\"))","v":""},{"$f":"IF(EV170=\"\",\"\",1)","v":""},{"$f":"IF(EU170=1,FB170,\"\")","v":""},1,{"$f":"IF(OR(FB170=\"\",FB170=0,M25=\"\"),\"\",IF(FB170=$FB$169,\"Crítico\",\"\"))","v":""},{"$f":"IF(EZ170=\"\",\"\",1)","v":""},{"$f":"IF(FE170=\"\",\"\",FE170+FE141)","v":""},{"$f":"IF(OR(FE170=\"\",FE170=0),\"\",IF(FE170=$FE$169,\"Crítico\",\"\"))","v":""},{"$f":"IF(FC170=\"\",\"\",1)","v":""},{"$f":"IF(FH170=0,\"\",FH170+FK170+FO170+FS170+FW170+GA170+GE170+GI170+GM170+GQ170+GU170+GY170+HC170+HG170+HK170+HO170+HS170+HW170+IA170+IE170+II170+IM170+IQ170+IU170+IY170)","v":""},{"$f":"IF(OR(F25=\"\",G25=\"\"),\"\",F25)","v":""},{"$f":"IF(OR(F25=\"\",G25=\"\"),\"\",G25)","v":""},{"$f":"IF(OR($P$16=\"\",H25=\"\",EP170=\"\",$AU$8=\"\"),0,IF($M$15=\"\",M25*$B$18*$AU$19*61.7*100000*((($AU$8*H25)/$B$17)^1.85/($P$16^1.85*EP170^4.87)),M25*$B$18*$AU$19*((4*$P$16*((((66.7*($AU$8*H25)/$B$17)/(PI()*EP170^2))^7)/(EP170/1000))^(1/4))/(EP170/1000))))","v":0},null,{"$f":"FJ141","v":""},{"$f":"IF(FJ170=\"\",0,LOOKUP(FJ170,$EY$170:$EY$194,$FH$170:$FH$194))","v":0},null,null,{"$f":"FN141","v":""},{"$f":"IF(FN170=\"\",0,LOOKUP(FN170,$EY$170:$EY$194,$FH$170:$FH$194))","v":0},null,null,{"$f":"FR141","v":""},{"$f":"IF(FR170=\"\",0,LOOKUP(FR170,$EY$170:$EY$194,$FH$170:$FH$194))","v":0},null,null,{"$f":"FV141","v":""},{"$f":"IF(FV170=\"\",0,LOOKUP(FV170,$EY$170:$EY$194,$FH$170:$FH$194))","v":0},null,null,{"$f":"FZ141","v":""},{"$f":"IF(FZ170=\"\",0,LOOKUP(FZ170,$EY$170:$EY$194,$FH$170:$FH$194))","v":0},null,null,{"$f":"GD141","v":""},{"$f":"IF(GD170=\"\",0,LOOKUP(GD170,$EY$170:$EY$194,$FH$170:$FH$194))","v":0},null,null,{"$f":"GH141","v":""},{"$f":"IF(GH170=\"\",0,LOOKUP(GH170,$EY$170:$EY$194,$FH$170:$FH$194))","v":0},null,null,{"$f":"GL141","v":""},{"$f":"IF(GL170=\"\",0,LOOKUP(GL170,$EY$170:$EY$194,$FH$170:$FH$194))","v":0},null,null,{"$f":"GP141","v":""},{"$f":"IF(GP170=\"\",0,LOOKUP(GP170,$EY$170:$EY$194,$FH$170:$FH$194))","v":0},null,null,{"$f":"GT141","v":""},{"$f":"IF(GT170=\"\",0,LOOKUP(GT170,$EY$170:$EY$194,$FH$170:$FH$194))","v":0},null,null,{"$f":"GX141","v":""},{"$f":"IF(GX170=\"\",0,LOOKUP(GX170,$EY$170:$EY$194,$FH$170:$FH$194))","v":0},null,null,{"$f":"HB141","v":""},{"$f":"IF(HB170=\"\",0,LOOKUP(HB170,$EY$170:$EY$194,$FH$170:$FH$194))","v":0},null,null,{"$f":"HF141","v":""},{"$f":"IF(HF170=\"\",0,LOOKUP(HF170,$EY$170:$EY$194,$FH$170:$FH$194))","v":0},null,null,{"$f":"HJ141","v":""},{"$f":"IF(HJ170=\"\",0,LOOKUP(HJ170,$EY$170:$EY$194,$FH$170:$FH$194))","v":0},null,null,{"$f":"HN141","v":""},{"$f":"IF(HN170=\"\",0,LOOKUP(HN170,$EY$170:$EY$194,$FH$170:$FH$194))","v":0},null,null,{"$f":"HR141","v":""},{"$f":"IF(HR170=\"\",0,LOOKUP(HR170,$EY$170:$EY$194,$FH$170:$FH$194))","v":0},null,null,{"$f":"HV141","v":""},{"$f":"IF(HV170=\"\",0,LOOKUP(HV170,$EY$170:$EY$194,$FH$170:$FH$194))","v":0},null,null,{"$f":"HZ141","v":""},{"$f":"IF(HZ170=\"\",0,LOOKUP(HZ170,$EY$170:$EY$194,$FH$170:$FH$194))","v":0},null,null,{"$f":"ID141","v":""},{"$f":"IF(ID170=\"\",0,LOOKUP(ID170,$EY$170:$EY$194,$FH$170:$FH$194))","v":0},null,null,{"$f":"IH141","v":""},{"$f":"IF(IH170=\"\",0,LOOKUP(IH170,$EY$170:$EY$194,$FH$170:$FH$194))","v":0},null,null,{"$f":"IL141","v":""},{"$f":"IF(IL170=\"\",0,LOOKUP(IL170,$EY$170:$EY$194,$FH$170:$FH$194))","v":0},null,null,{"$f":"IP141","v":""},{"$f":"IF(IP170=\"\",0,LOOKUP(IP170,$EY$170:$EY$194,$FH$170:$FH$194))","v":0},null,null,{"$f":"IT141","v":""},{"$f":"IF(IT170=\"\",0,LOOKUP(IT170,$EY$170:$EY$194,$FH$170:$FH$194))","v":0},null,null,{"$f":"IX141","v":""},{"$f":"IF(IX170=\"\",0,LOOKUP(IX170,$EY$170:$EY$194,$FH$170:$FH$194))","v":0}]
[null,null,null,null,null,null,null,null,null,null,null,null,null,null,null,null,null,null,null,null,null,null,null,null,null,null,null,null,null,null,null,null,null,null,null,null,null,null,null,null,null,null,null,null,null,null,null,null,null,null,null,null,null,null,null,null,null,null,null,null,null,null,null,null,null,null,null,null,null,null,null,null,null,null,null,null,null,null,null,null,null,null,null,null,null,null,null,null,null,null,null,null,null,null,null,null,null,null,null,null,null,null,null,null,null,null,null,null,null,null,null,null,null,null,null,null,null,null,null,null,null,null,null,null,null,null,null,{"$f":"IF(EF171=\"c\",DY171*$AU$19/$BK$11,\"\")","v":""},{"$f":"IF(EF171=\"c\",K26,\"\")","v":""},{"$f":"IF(EF171=\"c\",EA171*EB171,\"\")","v":""},{"$f":"IF(EF171=\"c\",M26,\"\")","v":""},{"$f":"IF(OR($P$16=\"\",EE171=\"\",EC171=\"\",ED171=\"\"),\"\",IF($M$15=\"\",$B$18*$AU$19*61.7*100000*((EE171/$B$17)^1.85/($P$16^1.85*ED171^4.87)),$B$18*$AU$19*((4*$P$16*((EC171^7)/(ED171/1000))^(1/4))/(ED171/1000))))","v":""},{"$f":"IF(OR(EE171=\"\",ED171=\"\"),\"\",(66.7*EE171/$B$17)/(PI()*ED171^2))","v":""},{"$f":"W26","v":""},{"$f":"IF(EF171=\"c\",MIN($R$25:$R$49),\"\")","v":""},{"$f":"DO26","v":""},2,"","",null,null,null,"","","",{"$f":"IF(OR(EN171=\"\",EN171=0),\"\",IF($EO171>'Quadro 1'!$G$23,'Quadro 1'!$G$23,IF($EO171<'Quadro 1'!$G$10,'Quadro 1'!$G$10,EO171)))","v":""},null,"Crítico",{"$f":"IF(ER171=\"\",\"\",1)","v":1},"",0,"",{"$f":"IF(EV171=\"\",\"\",1)","v":""},"",2,"",{"$f":"IF(EZ171=\"\",\"\",1)","v":""},{"$f":"IF(FE171=\"\",\"\",FE171+FE142)","v":""},"",{"$f":"IF(FC171=\"\",\"\",1)","v":""},"","","",0,null,{"$f":"FJ142","v":""},0,null,null,{"$f":"FN142","v":""},0,null,null,{"$f":"FR142","v":""},0,null,null,{"$f":"FV142","v":""},0,null,null,{"$f":"FZ142","v":""},0,null,null,{"$f":"GD142","v":""},0,null,null,{"$f":"GH142","v":""},0,null,null,{"$f":"GL142","v":""},0,null,null,{"$f":"GP142","v":""},0,null,null,{"$f":"GT142","v":""},0,null,null,{"$f":"GX142","v":""},0,null,null,{"$f":"HB142","v":""},0,null,null,{"$f":"HF142","v":""},0,null,null,{"$f":"HJ142","v":""},0,null,null,{"$f":"HN142","v":""},0,null,null,{"$f":"HR142","v":""},0,null,null,{"$f":"HV142","v":""},0,null,null,{"$f":"HZ142","v":""},0,null,null,{"$f":"ID142","v":""},0,null,null,{"$f":"IH142","v":""},0,null,null,{"$f":"IL142","v":""},0,null,null,{"$f":"IP142","v":""},0,null,null,{"$f":"IT142","v":""},0,null,null,{"$f":"IX142","v":""},0]
[null,null,null,null,null,null,null,null,null,null,null,null,null,null,null,null,null,null,null,null,null,null,null,null,null,null,null,null,null,null,null,null,null,null,null,null,null,null,null,null,null,null,null,null,null,null,null,null,null,null,null,null,null,null,null,null,null,null,null,null,null,null,null,null,null,null,null,null,null,null,null,null,null,null,null,null,null,null,null,null,null,null,null,null,null,null,null,null,null,null,null,null,null,null,null,null,null,null,null,null,null,null,null,null,null,null,null,null,null,null,null,null,null,null,null,null,null,null,null,null,null,null,null,null,null,null,null,"","","","","","","","",{"$f":"DO27","v":""},3,"","",null,null,null,"","","",{"$f":"IF(OR(EN172=\"\",EN172=0),\"\",IF($EO172>'Quadro 1'!$G$23,'Quadro 1'!$G$23,IF($EO172<'Quadro 1'!$G$10,'Quadro 1'!$G$10,EO172)))","v":""},null,"Crítico",1,"",0,"","","",3,"","","","","","","","",0,null,"",0,null,null,"",0,null,null,"",0,null,null,"",0,null,null,"",0,null,null,"",0,null,null,"",0,null,null,"",0,null,null,"",0,null,null,"",0,null,null,"",0,null,null,"",0,null,null,"",0,null,null,"",0,null,null,"",0,null,null,"",0,null,null,"",0,null,null,"",0,null,null,"",0,null,null,"",0,null,null,"",0,null,null,"",0,null,null,"",0,null,null,"",0]
[null,null,null,null,null,null,null,null,null,null,null,null,null,null,null,null,null,null,null,null,null,null,null,null,null,null,null,null,null,null,null,null,null,null,null,null,null,null,null,null,null,null,null,null,null,null,null,null,null,null,null,null,null,null,null,null,null,null,null,null,null,null,null,null,null,null,null,null,null,null,null,null,null,null,null,null,null,null,null,null,null,null,null,null,null,null,null,null,null,null,null,null,null,null,null,null,null,null,null,null,null,null,null,null,null,null,null,null,null,null,null,null,null,null,null,null,null,null,null,null,null,null,null,null,null,null,null,"","","","","","","","",{"$f":"DO28","v":""},4,"","",null,null,null,"","","",{"$f":"IF(OR(EN173=\"\",EN173=0),\"\",IF($EO173>'Quadro 1'!$G$23,'Quadro 1'!$G$23,IF($EO173<'Quadro 1'!$G$10,'Quadro 1'!$G$10,EO173)))","v":""},null,"Crítico",1,"",0,"","","",4,"","","","","","","","",0,null,"",0,null,null,"",0,null,null,"",0,null,null,"",0,null,null,"",0,null,null,"",0,null,null,"",0,null,null,"",0,null,null,"",0,null,null,"",0,null,null,"",0,null,null,"",0,null,null,"",0,null,null,"",0,null,null,"",0,null,null,"",0,null,null,"",0,null,null,"",0,null,null,"",0,null,null,"",0,null,null,"",0,null,null,"",0,null,null,"",0,null,null,"",0]
[null,null,null,null,null,null,null,null,null,null,null,null,null,null,null,null,null,null,null,null,null,null,null,null,null,null,null,null,null,null,null,null,null,null,null,null,null,null,null,null,null,null,null,null,null,null,null,null,null,null,null,null,null,null,null,null,null,null,null,null,null,null,null,null,null,null,null,null,null,null,null,null,null,null,null,null,null,null,null,null,null,null,null,null,null,null,null,null,null,null,null,null,null,null,null,null,null,null,null,null,null,null,null,null,null,null,null,null,null,null,null,null,null,null,null,null,null,null,null,null,null,null,null,null,null,null,null,"","","","","","","","",{"$f":"DO29","v":""},5,{"$f":"DQ29","v":""},{"$f":"DR29","v":""},null,null,null,"","","",{"$f":"IF(OR(EN174=\"\",EN174=0),\"\",IF($EO174>'Quadro 1'!$G$23,'Quadro 1'!$G$23,IF($EO174<'Quadro 1'!$G$10,'Quadro 1'!$G$10,EO174)))","v":""},null,"Crítico",1,"",0,"","","",5,"","","","","","","","",0,null,"",0,null,null,"",0,null,null,"",0,null,null,"",0,null,null,"",0,null,null,"",0,null,null,"",0,null,null,"",0,null,null,"",0,null,null,"",0,null,null,"",0,null,null,"",0,null,null,"",0,null,null,"",0,null,null,"",0,null,null,"",0,null,null,"",0,null,null,"",0,null,null,"",0,null,null,"",0,null,null,"",0,null,null,"",0,null,null,"",0,null,null,"",0]
[null,null,null,null,null,null,null,null,null,null,null,null,null,null,null,null,null,null,null,null,null,null,null,null,null,null,null,null,null,null,null,null,null,null,null,null,null,null,null,null,null,null,null,null,null,null,null,null,null,null,null,null,null,null,null,null,null,null,null,null,null,null,null,null,null,null,null,null,null,null,null,null,null,null,null,null,null,null,null,null,null,null,null,null,null,null,null,null,null,null,null,null,null,null,null,null,null,null,null,null,null,null,null,null,null,null,null,null,null,null,null,null,null,null,null,null,null,null,null,null,null,null,null,null,null,null,null,"","","","","","","","","",6,"","",null,null,null,"","","",{"$f":"IF(OR(EN175=\"\",EN175=0),\"\",IF($EO175>'Quadro 1'!$G$23,'Quadro 1'!$G$23,IF($EO175<'Quadro 1'!$G$10,'Quadro 1'!$G$10,EO175)))","v":""},null,"Crítico",1,"",0,"","","",6,"","","","","","","","",0,null,"",0,null,null,"",0,null,null,"",0,null,null,"",0,null,null,"",0,null,null,"",0,null,null,"",0,null,null,"",0,null,null,"",0,null,null,"",0,null,null,"",0,null,null,"",0,null,null,"",0,null,null,"",0,null,null,"",0,null,null,"",0,null,null,"",0,null,null,"",0,null,null,"",0,null,null,"",0,null,null,"",0,null,null,"",0,null,null,"",0,null,null,"",0]
[null,null,null,null,null,null,null,null,null,null,null,null,null,null,null,null,null,null,null,null,null,null,null,null,null,null,null,null,null,null,null,null,null,null,null,null,null,null,null,null,null,null,null,null,null,null,null,null,null,null,null,null,null,null,null,null,null,null,null,null,null,null,null,null,null,null,null,null,null,null,null,null,null,null,null,null,null,null,null,null,null,null,null,null,null,null,null,null,null,null,null,null,null,null,null,null,null,null,null,null,null,null,null,null,null,null,null,null,null,null,null,null,null,null,null,null,null,null,null,null,null,null,null,null,null,null,null,"","","","","","","","","",7,"","",null,null,null,"","","",{"$f":"IF(OR(EN176=\"\",EN176=0),\"\",IF($EO176>'Quadro 1'!$G$23,'Quadro 1'!$G$23,IF($EO176<'Quadro 1'!$G$10,'Quadro 1'!$G$10,EO176)))","v":""},null,"Crítico",1,"",0,"","","",7,"","","","","","","","",0,null,"",0,null,null,"",0,null,null,"",0,null,null,"",0,null,null,"",0,null,null,"",0,null,null,"",0,null,null,"",0,null,null,"",0,null,null,"",0,null,null,"",0,null,null,"",0,null,null,"",0,null,null,"",0,null,null,"",0,null,null,"",0,null,null,"",0,null,null,"",0,null,null,"",0,null,null,"",0,null,null,"",0,null,null,"",0,null,null,"",0,null,null,"",0]
[null,null,null,null,null,null,null,null,null,null,null,null,null,null,null,null,null,null,null,null,null,null,null,null,null,null,null,null,null,null,null,null,null,null,null,null,null,null,null,null,null,null,null,null,null,null,null,null,null,null,null,null,null,null,null,null,null,null,null,null,null,null,null,null,null,null,null,null,null,null,null,null,null,null,null,null,null,null,null,null,null,null,null,null,null,null,null,null,null,null,null,null,null,null,null,null,null,null,null,null,null,null,null,null,null,null,null,null,null,null,null,null,null,null,null,null,null,null,null,null,null,null,null,null,null,null,null,"","","","","","","","","",8,"","",null,null,null,"","","",{"$f":"IF(OR(EN177=\"\",EN177=0),\"\",IF($EO177>'Quadro 1'!$G$23,'Quadro 1'!$G$23,IF($EO177<'Quadro 1'!$G$10,'Quadro 1'!$G$10,EO177)))","v":""},null,"Crítico",1,"",0,"","","",8,"","","","","","","","",0,null,"",0,null,null,"",0,null,null,"",0,null,null,"",0,null,null,"",0,null,null,"",0,null,null,"",0,null,null,"",0,null,null,"",0,null,null,"",0,null,null,"",0,null,null,"",0,null,null,"",0,null,null,"",0,null,null,"",0,null,null,"",0,null,null,"",0,null,null,"",0,null,null,"",0,null,null,"",0,null,null,"",0,null,null,"",0,null,null,"",0,null,null,"",0]
[null,null,null,null,null,null,null,null,null,null,null,null,null,null,null,null,null,null,null,null,null,null,null,null,null,null,null,null,null,null,null,null,null,null,null,null,null,null,null,null,null,null,null,null,null,null,null,null,null,null,null,null,null,null,null,null,null,null,null,null,null,null,null,null,null,null,null,null,null,null,null,null,null,null,null,null,null,null,null,null,null,null,null,null,null,null,null,null,null,null,null,null,null,null,null,null,null,null,null,null,null,null,null,null,null,null,null,null,null,null,null,null,null,null,null,null,null,null,null,null,null,null,null,null,null,null,null,"","","","","","","","","",9,"","",null,null,null,"","","",{"$f":"IF(OR(EN178=\"\",EN178=0),\"\",IF($EO178>'Quadro 1'!$G$23,'Quadro 1'!$G$23,IF($EO178<'Quadro 1'!$G$10,'Quadro 1'!$G$10,EO178)))","v":""},null,"Crítico",1,"",0,"","","",9,"","","","","","","","",0,null,"",0,null,null,"",0,null,null,"",0,null,null,"",0,null,null,"",0,null,null,"",0,null,null,"",0,null,null,"",0,null,null,"",0,null,null,"",0,null,null,"",0,null,null,"",0,null,null,"",0,null,null,"",0,null,null,"",0,null,null,"",0,null,null,"",0,null,null,"",0,null,null,"",0,null,null,"",0,null,null,"",0,null,null,"",0,null,null,"",0,null,null,"",0]
[null,null,null,null,null,null,null,null,null,null,null,null,null,null,null,null,null,null,null,null,null,null,null,null,null,null,null,null,null,null,null,null,null,null,null,null,null,null,null,null,null,null,null,null,null,null,null,null,null,null,null,null,null,null,null,null,null,null,null,null,null,null,null,null,null,null,null,null,null,null,null,null,null,null,null,null,null,null,null,null,null,null,null,null,null,null,null,null,null,null,null,null,null,null,null,null,null,null,null,null,null,null,null,null,null,null,null,null,null,null,null,null,null,null,null,null,null,null,null,null,null,null,null,null,null,null,null,"","","","","","","","","",10,"","",null,null,null,"","","",{"$f":"IF(OR(EN179=\"\",EN179=0),\"\",IF($EO179>'Quadro 1'!$G$23,'Quadro 1'!$G$23,IF($EO179<'Quadro 1'!$G$10,'Quadro 1'!$G$10,EO179)))","v":""},null,"Crítico",1,"",0,"","","",10,"","","","","","","","",0,null,"",0,null,null,"",0,null,null,"",0,null,null,"",0,null,null,"",0,null,null,"",0,null,null,"",0,null,null,"",0,null,null,"",0,null,null,"",0,null,null,"",0,null,null,"",0,null,null,"",0,null,null,"",0,null,null,"",0,null,null,"",0,null,null,"",0,null,null,"",0,null,null,"",0,null,null,"",0,null,null,"",0,null,null,"",0,null,null,"",0,null,null,"",0]
[null,null,null,null,null,null,null,null,null,null,null,null,null,null,null,null,null,null,null,null,null,null,null,null,null,null,null,null,null,null,null,null,null,null,null,null,null,null,null,null,null,null,null,null,null,null,null,null,null,null,null,null,null,null,null,null,null,null,null,null,null,null,null,null,null,null,null,null,null,null,null,null,null,null,null,null,null,null,null,null,null,null,null,null,null,null,null,null,null,null,null,null,null,null,null,null,null,null,null,null,null,null,null,null,null,null,null,null,null,null,null,null,null,null,null,null,null,null,null,null,null,null,null,null,null,null,null,"","","","","","","","","",11,"","",null,null,null,"","","",{"$f":"IF(OR(EN180=\"\",EN180=0),\"\",IF($EO180>'Quadro 1'!$G$23,'Quadro 1'!$G$23,IF($EO180<'Quadro 1'!$G$10,'Quadro 1'!$G$10,EO180)))","v":""},null,"Crítico",1,"",0,"","","",11,"","","","","","","","",0,null,"",0,null,null,"",0,null,null,"",0,null,null,"",0,null,null,"",0,null,null,"",0,null,null,"",0,null,null,"",0,null,null,"",0,null,null,"",0,null,null,"",0,null,null,"",0,null,null,"",0,null,null,"",0,null,null,"",0,null,null,"",0,null,null,"",0,null,null,"",0,null,null,"",0,null,null,"",0,null,null,"",0,null,null,"",0,null,null,"",0,null,null,"",0]
[null,null,null,null,null,null,null,null,null,null,null,null,null,null,null,null,null,null,null,null,null,null,null,null,null,null,null,null,null,null,null,null,null,null,null,null,null,null,null,null,null,null,null,null,null,null,null,null,null,null,null,null,null,null,null,null,null,null,null,null,null,null,null,null,null,null,null,null,null,null,null,null,null,null,null,null,null,null,null,null,null,null,null,null,null,null,null,null,null,null,null,null,null,null,null,null,null,null,null,null,null,null,null,null,null,null,null,null,null,null,null,null,null,null,null,null,null,null,null,null,null,null,null,null,null,null,null,"","","","","","","","","",12,"","",null,null,null,"","","",{"$f":"IF(OR(EN181=\"\",EN181=0),\"\",IF($EO181>'Quadro 1'!$G$23,'Quadro 1'!$G$23,IF($EO181<'Quadro 1'!$G$10,'Quadro 1'!$G$10,EO181)))","v":""},null,"Crítico",1,"",0,"","","",12,"","","","","","","","",0,null,"",0,null,null,"",0,null,null,"",0,null,null,"",0,null,null,"",0,null,null,"",0,null,null,"",0,null,null,"",0,null,null,"",0,null,null,"",0,null,null,"",0,null,null,"",0,null,null,"",0,null,null,"",0,null,null,"",0,null,null,"",0,null,null,"",0,null,null,"",0,null,null,"",0,null,null,"",0,null,null,"",0,null,null,"",0,null,null,"",0,null,null,"",0]
[null,null,null,null,null,null,null,null,null,null,null,null,null,null,null,null,null,null,null,null,null,null,null,null,null,null,null,null,null,null,null,null,null,null,null,null,null,null,null,null,null,null,null,null,null,null,null,null,null,null,null,null,null,null,null,null,null,null,null,null,null,null,null,null,null,null,null,null,null,null,null,null,null,null,null,null,null,null,null,null,null,null,null,null,null,null,null,null,null,null,null,null,null,null,null,null,null,null,null,null,null,null,null,null,null,null,null,null,null,null,null,null,null,null,null,null,null,null,null,null,null,null,null,null,null,null,null,"","","","","","","","","",13,"","",null,null,null,"","","",{"$f":"IF(OR(EN182=\"\",EN182=0),\"\",IF($EO182>'Quadro 1'!$G$23,'Quadro 1'!$G$23,IF($EO182<'Quadro 1'!$G$10,'Quadro 1'!$G$10,EO182)))","v":""},null,"Crítico",1,"",0,"","","",13,"","","","","","","","",0,null,"",0,null,null,"",0,null,null,"",0,null,null,"",0,null,null,"",0,null,null,"",0,null,null,"",0,null,null,"",0,null,null,"",0,null,null,"",0,null,null,"",0,null,null,"",0,null,null,"",0,null,null,"",0,null,null,"",0,null,null,"",0,null,null,"",0,null,null,"",0,null,null,"",0,null,null,"",0,null,null,"",0,null,null,"",0,null,null,"",0,null,null,"",0]
[null,null,null,null,null,null,null,null,null,null,null,null,null,null,null,null,null,null,null,null,null,null,null,null,null,null,null,null,null,null,null,null,null,null,null,null,null,null,null,null,null,null,null,null,null,null,null,null,null,null,null,null,null,null,null,null,null,null,null,null,null,null,null,null,null,null,null,null,null,null,null,null,null,null,null,null,null,null,null,null,null,null,null,null,null,null,null,null,null,null,null,null,null,null,null,null,null,null,null,null,null,null,null,null,null,null,null,null,null,null,null,null,null,null,null,null,null,null,null,null,null,null,null,null,null,null,null,"","","","","","","","","",14,"","",null,null,null,"","","",{"$f":"IF(OR(EN183=\"\",EN183=0),\"\",IF($EO183>'Quadro 1'!$G$23,'Quadro 1'!$G$23,IF($EO183<'Quadro 1'!$G$10,'Quadro 1'!$G$10,EO183)))","v":""},null,"Crítico",1,"",0,"","","",14,"","","","","","","","",0,null,"",0,null,null,"",0,null,null,"",0,null,null,"",0,null,null,"",0,null,null,"",0,null,null,"",0,null,null,"",0,null,null,"",0,null,null,"",0,null,null,"",0,null,null,"",0,null,null,"",0,null,null,"",0,null,null,"",0,null,null,"",0,null,null,"",0,null,null,"",0,null,null,"",0,null,null,"",0,null,null,"",0,null,null,"",0,null,null,"",0,null,null,"",0]
[null,null,null,null,null,null,null,null,null,null,null,null,null,null,null,null,null,null,null,null,null,null,null,null,null,null,null,null,null,null,null,null,null,null,null,null,null,null,null,null,null,null,null,null,null,null,null,null,null,null,null,null,null,null,null,null,null,null,null,null,null,null,null,null,null,null,null,null,null,null,null,null,null,null,null,null,null,null,null,null,null,null,null,null,null,null,null,null,null,null,null,null,null,null,null,null,null,null,null,null,null,null,null,null,null,null,null,null,null,null,null,null,null,null,null,null,null,null,null,null,null,null,null,null,null,null,null,"","","","","","","","","",15,"","",null,null,null,"","","",{"$f":"IF(OR(EN184=\"\",EN184=0),\"\",IF($EO184>'Quadro 1'!$G$23,'Quadro 1'!$G$23,IF($EO184<'Quadro 1'!$G$10,'Quadro 1'!$G$10,EO184)))","v":""},null,"Crítico",1,"",0,"","","",15,"","","","","","","","",0,null,"",0,null,null,"",0,null,null,"",0,null,null,"",0,null,null,"",0,null,null,"",0,null,null,"",0,null,null,"",0,null,null,"",0,null,null,"",0,null,null,"",0,null,null,"",0,null,null,"",0,null,null,"",0,null,null,"",0,null,null,"",0,null,null,"",0,null,null,"",0,null,null,"",0,null,null,"",0,null,null,"",0,null,null,"",0,null,null,"",0,null,null,"",0]
[null,null,null,null,null,null,null,null,null,null,null,null,null,null,null,null,null,null,null,null,null,null,null,null,null,null,null,null,null,null,null,null,null,null,null,null,null,null,null,null,null,null,null,null,null,null,null,null,null,null,null,null,null,null,null,null,null,null,null,null,null,null,null,null,null,null,null,null,null,null,null,null,null,null,null,null,null,null,null,null,null,null,null,null,null,null,null,null,null,null,null,null,null,null,null,null,null,null,null,null,null,null,null,null,null,null,null,null,null,null,null,null,null,null,null,null,null,null,null,null,null,null,null,null,null,null,null,"","","","","","","","","",16,"","",null,null,null,"","","",{"$f":"IF(OR(EN185=\"\",EN185=0),\"\",IF($EO185>'Quadro 1'!$G$23,'Quadro 1'!$G$23,IF($EO185<'Quadro 1'!$G$10,'Quadro 1'!$G$10,EO185)))","v":""},null,"Crítico",1,"",0,"","","",16,"","","","","","","","",0,null,"",0,null,null,"",0,null,null,"",0,null,null,"",0,null,null,"",0,null,null,"",0,null,null,"",0,null,null,"",0,null,null,"",0,null,null,"",0,null,null,"",0,null,null,"",0,null,null,"",0,null,null,"",0,null,null,"",0,null,null,"",0,null,null,"",0,null,null,"",0,null,null,"",0,null,null,"",0,null,null,"",0,null,null,"",0,null,null,"",0,null,null,"",0]
[null,null,null,null,null,null,null,null,null,null,null,null,null,null,null,null,null,null,null,null,null,null,null,null,null,null,null,null,null,null,null,null,null,null,null,null,null,null,null,null,null,null,null,null,null,null,null,null,null,null,null,null,null,null,null,null,null,null,null,null,null,null,null,null,null,null,null,null,null,null,null,null,null,null,null,null,null,null,null,null,null,null,null,null,null,null,null,null,null,null,null,null,null,null,null,null,null,null,null,null,null,null,null,null,null,null,null,null,null,null,null,null,null,null,null,null,null,null,null,null,null,null,null,null,null,null,null,"","","","","","","","","",17,"","",null,null,null,"","","",{"$f":"IF(OR(EN186=\"\",EN186=0),\"\",IF($EO186>'Quadro 1'!$G$23,'Quadro 1'!$G$23,IF($EO186<'Quadro 1'!$G$10,'Quadro 1'!$G$10,EO186)))","v":""},null,"Crítico",1,"",0,"","","",17,"","","","","","","","",0,null,"",0,null,null,"",0,null,null,"",0,null,null,"",0,null,null,"",0,null,null,"",0,null,null,"",0,null,null,"",0,null,null,"",0,null,null,"",0,null,null,"",0,null,null,"",0,null,null,"",0,null,null,"",0,null,null,"",0,null,null,"",0,null,null,"",0,null,null,"",0,null,null,"",0,null,null,"",0,null,null,"",0,null,null,"",0,null,null,"",0,null,null,"",0]
[null,null,null,null,null,null,null,null,null,null,null,null,null,null,null,null,null,null,null,null,null,null,null,null,null,null,null,null,null,null,null,null,null,null,null,null,null,null,null,null,null,null,null,null,null,null,null,null,null,null,null,null,null,null,null,null,null,null,null,null,null,null,null,null,null,null,null,null,null,null,null,null,null,null,null,null,null,null,null,null,null,null,null,null,null,null,null,null,null,null,null,null,null,null,null,null,null,null,null,null,null,null,null,null,null,null,null,null,null,null,null,null,null,null,null,null,null,null,null,null,null,null,null,null,null,null,null,"","","","","","","","","",18,"","",null,null,null,"","","",{"$f":"IF(OR(EN187=\"\",EN187=0),\"\",IF($EO187>'Quadro 1'!$G$23,'Quadro 1'!$G$23,IF($EO187<'Quadro 1'!$G$10,'Quadro 1'!$G$10,EO187)))","v":""},null,"Crítico",1,"",0,"","","",18,"","","","","","","","",0,null,"",0,null,null,"",0,null,null,"",0,null,null,"",0,null,null,"",0,null,null,"",0,null,null,"",0,null,null,"",0,null,null,"",0,null,null,"",0,null,null,"",0,null,null,"",0,null,null,"",0,null,null,"",0,null,null,"",0,null,null,"",0,null,null,"",0,null,null,"",0,null,null,"",0,null,null,"",0,null,null,"",0,null,null,"",0,null,null,"",0,null,null,"",0]
[null,null,null,null,null,null,null,null,null,null,null,null,null,null,null,null,null,null,null,null,null,null,null,null,null,null,null,null,null,null,null,null,null,null,null,null,null,null,null,null,null,null,null,null,null,null,null,null,null,null,null,null,null,null,null,null,null,null,null,null,null,null,null,null,null,null,null,null,null,null,null,null,null,null,null,null,null,null,null,null,null,null,null,null,null,null,null,null,null,null,null,null,null,null,null,null,null,null,null,null,null,null,null,null,null,null,null,null,null,null,null,null,null,null,null,null,null,null,null,null,null,null,null,null,null,null,null,"","","","","","","","","",19,"","",null,null,null,"","","",{"$f":"IF(OR(EN188=\"\",EN188=0),\"\",IF($EO188>'Quadro 1'!$G$23,'Quadro 1'!$G$23,IF($EO188<'Quadro 1'!$G$10,'Quadro 1'!$G$10,EO188)))","v":""},null,"Crítico",1,"",0,"","","",19,"","","","","","","","",0,null,"",0,null,null,"",0,null,null,"",0,null,null,"",0,null,null,"",0,null,null,"",0,null,null,"",0,null,null,"",0,null,null,"",0,null,null,"",0,null,null,"",0,null,null,"",0,null,null,"",0,null,null,"",0,null,null,"",0,null,null,"",0,null,null,"",0,null,null,"",0,null,null,"",0,null,null,"",0,null,null,"",0,null,null,"",0,null,null,"",0,null,null,"",0]
[null,null,null,null,null,null,null,null,null,null,null,null,null,null,null,null,null,null,null,null,null,null,null,null,null,null,null,null,null,null,null,null,null,null,null,null,null,null,null,null,null,null,null,null,null,null,null,null,null,null,null,null,null,null,null,null,null,null,null,null,null,null,null,null,null,null,null,null,null,null,null,null,null,null,null,null,null,null,null,null,null,null,null,null,null,null,null,null,null,null,null,null,null,null,null,null,null,null,null,null,null,null,null,null,null,null,null,null,null,null,null,null,null,null,null,null,null,null,null,null,null,null,null,null,null,null,null,"","","","","","","","","",20,"","",null,null,null,"","","",{"$f":"IF(OR(EN189=\"\",EN189=0),\"\",IF($EO189>'Quadro 1'!$G$23,'Quadro 1'!$G$23,IF($EO189<'Quadro 1'!$G$10,'Quadro 1'!$G$10,EO189)))","v":""},null,"Crítico",1,"",0,"","","",20,"","","","","","","","",0,null,"",0,null,null,"",0,null,null,"",0,null,null,"",0,null,null,"",0,null,null,"",0,null,null,"",0,null,null,"",0,null,null,"",0,null,null,"",0,null,null,"",0,null,null,"",0,null,null,"",0,null,null,"",0,null,null,"",0,null,null,"",0,null,null,"",0,null,null,"",0,null,null,"",0,null,null,"",0,null,null,"",0,null,null,"",0,null,null,"",0,null,null,"",0]
[null,null,null,null,null,null,null,null,null,null,null,null,null,null,null,null,null,null,null,null,null,null,null,null,null,null,null,null,null,null,null,null,null,null,null,null,null,null,null,null,null,null,null,null,null,null,null,null,null,null,null,null,null,null,null,null,null,null,null,null,null,null,null,null,null,null,null,null,null,null,null,null,null,null,null,null,null,null,null,null,null,null,null,null,null,null,null,null,null,null,null,null,null,null,null,null,null,null,null,null,null,null,null,null,null,null,null,null,null,null,null,null,null,null,null,null,null,null,null,null,null,null,null,null,null,null,null,"","","","","","","","","",21,"","",null,null,null,"","","",{"$f":"IF(OR(EN190=\"\",EN190=0),\"\",IF($EO190>'Quadro 1'!$G$23,'Quadro 1'!$G$23,IF($EO190<'Quadro 1'!$G$10,'Quadro 1'!$G$10,EO190)))","v":""},null,"Crítico",1,"",0,"","","",21,"","","","","","","","",0,null,"",0,null,null,"",0,null,null,"",0,null,null,"",0,null,null,"",0,null,null,"",0,null,null,"",0,null,null,"",0,null,null,"",0,null,null,"",0,null,null,"",0,null,null,"",0,null,null,"",0,null,null,"",0,null,null,"",0,null,null,"",0,null,null,"",0,null,null,"",0,null,null,"",0,null,null,"",0,null,null,"",0,null,null,"",0,null,null,"",0,null,null,"",0]
[null,null,null,null,null,null,null,null,null,null,null,null,null,null,null,null,null,null,null,null,null,null,null,null,null,null,null,null,null,null,null,null,null,null,null,null,null,null,null,null,null,null,null,null,null,null,null,null,null,null,null,null,null,null,null,null,null,null,null,null,null,null,null,null,null,null,null,null,null,null,null,null,null,null,null,null,null,null,null,null,null,null,null,null,null,null,null,null,null,null,null,null,null,null,null,null,null,null,null,null,null,null,null,null,null,null,null,null,null,null,null,null,null,null,null,null,null,null,null,null,null,null,null,null,null,null,null,"","","","","","","","","",22,"","",null,null,null,"","","",{"$f":"IF(OR(EN191=\"\",EN191=0),\"\",IF($EO191>'Quadro 1'!$G$23,'Quadro 1'!$G$23,IF($EO191<'Quadro 1'!$G$10,'Quadro 1'!$G$10,EO191)))","v":""},null,"Crítico",1,"",0,"","","",22,"","","","","","","","",0,null,"",0,null,null,"",0,null,null,"",0,null,null,"",0,null,null,"",0,null,null,"",0,null,null,"",0,null,null,"",0,null,null,"",0,null,null,"",0,null,null,"",0,null,null,"",0,null,null,"",0,null,null,"",0,null,null,"",0,null,null,"",0,null,null,"",0,null,null,"",0,null,null,"",0,null,null,"",0,null,null,"",0,null,null,"",0,null,null,"",0,null,null,"",0]
[null,null,null,null,null,null,null,null,null,null,null,null,null,null,null,null,null,null,null,null,null,null,null,null,null,null,null,null,null,null,null,null,null,null,null,null,null,null,null,null,null,null,null,null,null,null,null,null,null,null,null,null,null,null,null,null,null,null,null,null,null,null,null,null,null,null,null,null,null,null,null,null,null,null,null,null,null,null,null,null,null,null,null,null,null,null,null,null,null,null,null,null,null,null,null,null,null,null,null,null,null,null,null,null,null,null,null,null,null,null,null,null,null,null,null,null,null,null,null,null,null,null,null,null,null,null,null,"","","","","","","","","",23,"","",null,null,null,"","","",{"$f":"IF(OR(EN192=\"\",EN192=0),\"\",IF($EO192>'Quadro 1'!$G$23,'Quadro 1'!$G$23,IF($EO192<'Quadro 1'!$G$10,'Quadro 1'!$G$10,EO192)))","v":""},null,"Crítico",1,"",0,"","","",23,"","","","","","","","",0,null,"",0,null,null,"",0,null,null,"",0,null,null,"",0,null,null,"",0,null,null,"",0,null,null,"",0,null,null,"",0,null,null,"",0,null,null,"",0,null,null,"",0,null,null,"",0,null,null,"",0,null,null,"",0,null,null,"",0,null,null,"",0,null,null,"",0,null,null,"",0,null,null,"",0,null,null,"",0,null,null,"",0,null,null,"",0,null,null,"",0,null,null,"",0]
[null,null,null,null,null,null,null,null,null,null,null,null,null,null,null,null,null,null,null,null,null,null,null,null,null,null,null,null,null,null,null,null,null,null,null,null,null,null,null,null,null,null,null,null,null,null,null,null,null,null,null,null,null,null,null,null,null,null,null,null,null,null,null,null,null,null,null,null,null,null,null,null,null,null,null,null,null,null,null,null,null,null,null,null,null,null,null,null,null,null,null,null,null,null,null,null,null,null,null,null,null,null,null,null,null,null,null,null,null,null,null,null,null,null,null,null,null,null,null,null,null,null,null,null,null,null,null,"","","","","","","","","",24,"","",null,null,null,"","","",{"$f":"IF(OR(EN193=\"\",EN193=0),\"\",IF($EO193>'Quadro 1'!$G$23,'Quadro 1'!$G$23,IF($EO193<'Quadro 1'!$G$10,'Quadro 1'!$G$10,EO193)))","v":""},null,"Crítico",1,"",0,"","","",24,"","","","","","","","",0,null,"",0,null,null,"",0,null,null,"",0,null,null,"",0,null,null,"",0,null,null,"",0,null,null,"",0,null,null,"",0,null,null,"",0,null,null,"",0,null,null,"",0,null,null,"",0,null,null,"",0,null,null,"",0,null,null,"",0,null,null,"",0,null,null,"",0,null,null,"",0,null,null,"",0,null,null,"",0,null,null,"",0,null,null,"",0,null,null,"",0,null,null,"",0]
[null,null,null,null,null,null,null,null,null,null,null,null,null,null,null,null,null,null,null,null,null,null,null,null,null,null,null,null,null,null,null,null,null,null,null,null,null,null,null,null,null,null,null,null,null,null,null,null,null,null,null,null,null,null,null,null,null,null,null,null,null,null,null,null,null,null,null,null,null,null,null,null,null,null,null,null,null,null,null,null,null,null,null,null,null,null,null,null,null,null,null,null,null,null,null,null,null,null,null,null,null,null,null,null,null,null,null,null,null,null,null,null,null,null,null,null,null,null,null,null,null,null,null,null,null,null,null,"","","","","","","","","",25,"","",null,null,null,"","","",{"$f":"IF(OR(EN194=\"\",EN194=0),\"\",IF($EO194>'Quadro 1'!$G$23,'Quadro 1'!$G$23,IF($EO194<'Quadro 1'!$G$10,'Quadro 1'!$G$10,EO194)))","v":""},null,"Crítico",1,"",0,"","","",25,"","","","","","","","",0,null,"",0,null,null,"",0,null,null,"",0,null,null,"",0,null,null,"",0,null,null,"",0,null,null,"",0,null,null,"",0,null,null,"",0,null,null,"",0,null,null,"",0,null,null,"",0,null,null,"",0,null,null,"",0,null,null,"",0,null,null,"",0,null,null,"",0,null,null,"",0,null,null,"",0,null,null,"",0,null,null,"",0,null,null,"",0,null,null,"",0,null,null,"",0]
[null,null,null,null,null,null,null,null,null,null,null,null,null,null,null,null,null,null,null,null,null,null,null,null,null,null,null,null,null,null,null,null,null,null,null,null,null,null,null,null,null,null,null,null,null,null,null,null,null,null,null,null,null,null,null,null,null,null,null,null,null,null,null,null,null,null,null,null,null,null,null,null,null,null,null,null,null,null,null,null,null,null,null,null,null,null,null,null,null,null,null,null,null,null,null,null,null,null,null,null,null,null,null,null,null,null,null,null,null,null,null,null,null,null,null,null,null,null,null,null,null,null,null,null,null,null,null,null,null,null,null,null,null,null,null,null,null,null,null,null,null,null,null,null,null,null,null,"Total:",{"$f":"SUM(ES170:ES194)","v":25},null,null,"Total:",{"$f":"SUM(EW170:EW194)","v":0},null,null,"Total:",{"$f":"SUM(FA170:FA194)","v":0},null,"Total:",{"$f":"SUM(FD170:FD194)","v":0},{"$f":"MAX(FE170:FE194)","v":0}]

{"sheet":"Curvas da Instalação","index":1,"n_rows":142,"n_cols":44,"rows_kept":142,"cut":false,"hidden":false,"merged":[[53,12,53,14],[52,2,52,3],[53,1,53,3],[53,5,53,8],[54,1,54,3],[53,10,53,11]]}
[]
[]
[]
[null,null,"Equação geral da curva da instalação:"]
[]
[]
[]
[]
[]
[]
[]
[]
[null,null,"Curvas da instalação mais relevantes:"]
[null,null,"Curva mais crítica",null,null,{"$f":"\"(com \"&'Cálc. Sist. Extinção Automática'!$AU$6&\" sprinklers em simultâneo)\"","v":"(com 12 sprinklers em simultâneo)"}]
[null,null,"Ptotal","Qmáx.","ΔPest.","Cinst."]
[null,null,{"$f":"'Cálc. Sist. Extinção Automática'!BL4","v":"kPa"},{"$f":"'Cálc. Sist. Extinção Automática'!BG4","v":"l/min"},{"$f":"C16","v":"kPa"},{"$f":"IF(AND(D104=1,E104=1),\"KPa/(l/min)¹·⁸⁵\",IF(AND(D104=1,E104=2),\"KPa/(l/s)¹·⁸⁵\",IF(AND(D104=1,E104=3),\"KPa/(l/h)¹·⁸⁵\",IF(AND(D104=1,E104=4),\"KPa/(m³/h)¹·⁸⁵\",IF(AND(D104=2,E104=1),\"bar/(l/min)¹·⁸⁵\",IF(AND(D104=2,E104=2),\"bar/(l/s)¹·⁸⁵\",IF(AND(D104=2,E104=3),\"bar/(l/h)¹·⁸⁵\",IF(AND(D104=2,E104=4),\"bar/(m³/h)¹·⁸⁵\",IF(AND(D104=3,E104=1),\"mca/(l/min)¹·⁸⁵\",IF(AND(D104=3,E104=2),\"mca/(l/s)¹·⁸⁵\",IF(AND(D104=3,E104=3),\"mca/(l/h)¹·⁸⁵\",IF(AND(D104=3,E104=4),\"mca/(m³/h)¹·⁸⁵\",IF(AND(D104=4,E104=1),\"Kgf/cm²/(l/min)¹·⁸⁵\",IF(AND(D104=4,E104=2),\"Kgf/cm²/(l/s)¹·⁸⁵\",IF(AND(D104=4,E104=3),\"Kgf/cm²/(l/h)¹·⁸⁵\",IF(AND(D104=4,E104=4),\"Kgf/cm²/(m³/h)¹·⁸⁵\",\"\"))))))))))))))))","v":"KPa/(l/min)¹·⁸⁵"}]
[null,null,{"$f":"IF('Cálc. Sist. Extinção Automática'!AU14=\"\",\"\",'Cálc. Sist. Extinção Automática'!AU14)","v":""},{"$f":"IF('Cálc. Sist. Extinção Automática'!AU14=\"\",\"\",'Cálc. Sist. Extinção Automática'!AU15)","v":""},{"$f":"IF('Cálc. Sist. Extinção Automática'!AU14=\"\",\"\",'Cálc. Sist. Extinção Automática'!DX169+'Cálc. Sist. Extinção Automática'!AX8*'Cálc. Sist. Extinção Automática'!AU19/'Cálc. Sist. Extinção Automática'!BK11)","v":""},{"$f":"IF(C17=\"\",\"\",IF('Cálc. Sist. Extinção Automática'!AU14=0,\"\",(C17-E17)/(D17^1.85)))","v":""}]
[]
[null,null,"Curva mais crítica (com 1 sprinkler em simultâneo)"]
[null,null,"Ptotal","Qmáx.","ΔPest.","Cinst."]
[null,null,{"$f":"C16","v":"kPa"},{"$f":"D16","v":"l/min"},{"$f":"E16","v":"kPa"},{"$f":"F16","v":"KPa/(l/min)¹·⁸⁵"}]
[null,null,{"$f":"IF(C17=\"\",\"\",IF('Cálc. Sist. Extinção Automática'!AU14=0,\"\",IF('Cálc. Sist. Extinção Automática'!AU14=0,\"\",'Cálc. Sist. Extinção Automática'!DV169+'Cálc. Sist. Extinção Automática'!AY10)))","v":""},{"$f":"IF(C22=\"\",\"\",IF('Cálc. Sist. Extinção Automática'!AU14=0,\"\",MIN('Cálc. Sist. Extinção Automática'!R25:R49)))","v":""},{"$f":"IF('Cálc. Sist. Extinção Automática'!AU14=0,\"\",IF(E17=0,0,E17))","v":""},{"$f":"IF(C22=\"\",\"\",IF('Cálc. Sist. Extinção Automática'!AU14=0,\"\",(C22-E22)/(D22^1.85)))","v":""}]
[]
[null,null,null," Identificação do nó de derivação"]
[null,null,"Curva menos crítica",null,null,{"$f":"\"(com \"&'Cálc. Sist. Extinção Automática'!$AU$6&\" sprinklers em simultâneo)\"","v":"(com 12 sprinklers em simultâneo)"}]
[null,null,"Ptotal","Qmáx.","ΔPest.","Cinst."]
[null,null,{"$f":"C21","v":"kPa"},{"$f":"D21","v":"l/min"},{"$f":"E21","v":"kPa"},{"$f":"F21","v":"KPa/(l/min)¹·⁸⁵"}]
[null,null,{"$f":"IFERROR(IF(AND(Y53=\"\",AH48=\"\"),\"\",IF(Y54=\"ok\",C17-Y53,AH48+'Cálc. Sist. Extinção Automática'!AX10)),\"\")","v":""},{"$f":"IF(C28=\"\",\"\",IF('Cálc. Sist. Extinção Automática'!AU14=0,\"\",IF(D17=0,0,D17)))","v":""},{"$f":"IFERROR(IF('Cálc. Sist. Extinção Automática'!AU14=\"\",\"\",IF(Y54=\"ok\",E17-Y53,AG50+AG51+'Cálc. Sist. Extinção Automática'!AX8*'Cálc. Sist. Extinção Automática'!AU19/'Cálc. Sist. Extinção Automática'!BK11)),\"\")","v":""},{"$f":"IFERROR(IF('Cálc. Sist. Extinção Automática'!AU14=0,\"\",(C28-E28)/(D28^1.85)),\"\")","v":""}]
[]
[null,null,"Curva menos crítica (com 1 sprinkler em simultâneo)"]
[null,null,"Ptotal","Qmáx.","ΔPest.","Cinst."]
[null,null,{"$f":"C27","v":"kPa"},{"$f":"D27","v":"l/min"},{"$f":"E27","v":"kPa"},{"$f":"F27","v":"KPa/(l/min)¹·⁸⁵"}]
[null,null,{"$f":"IFERROR(IF(AND(Y53=\"\",AR48=\"\"),\"\",IF(Y54=\"ok\",C17-Y53,AR48+'Cálc. Sist. Extinção Automática'!AX10)),\"\")","v":""},{"$f":"IF(C33=\"\",\"\",IF('Cálc. Sist. Extinção Automática'!AU14=0,\"\",IF(D22=0,0,D22)))","v":""},{"$f":"IF(C33=\"\",\"\",IF(Y54=\"ok\",E17-Y53,IF('Cálc. Sist. Extinção Automática'!AU14=0,\"\",IF(E28=0,0,E28))))","v":""},{"$f":"IFERROR(IF('Cálc. Sist. Extinção Automática'!AU14=0,\"\",(C33-E33)/(D33^1.85)),\"\")","v":""},null,null,null,null,null,null,null,null,null,{"$f":"IF('Cálc. Sist. Extinção Automática'!AU19=\"\",\"\",\"=\")","v":"="},{"$f":"IF('Cálc. Sist. Extinção Automática'!AX9=\"\",\"?\",'Cálc. Sist. Extinção Automática'!AX9)","v":"?"},"L =",{"$f":"IF('Cálc. Sist. Extinção Automática'!AR6=\"\",\"?\",IF('Cálc. Sist. Extinção Automática'!AR6-ABS('Cálc. Sist. Extinção Automática'!AR8)=0,'Cálc. Sist. Extinção Automática'!AR6,'Cálc. Sist. Extinção Automática'!AR6-ABS('Cálc. Sist. Extinção Automática'!AR8)))","v":"?"},{"$f":"IF(S33<>\"\",\"m\",\"\")","v":"m"},{"$f":"IF(AND($S$34>0,S34<>\"?\",S34<>\"\"),\"Nota: com a bomba em aspiração\",\"\")","v":""}]
[null,null,null,null,null,null,null,null,null,null,null,null,null,null,null,null,null,"h =",{"$f":"IF('Cálc. Sist. Extinção Automática'!AR8=\"\",\"?\",'Cálc. Sist. Extinção Automática'!AR8)","v":"?"},{"$f":"IF(S34<>\"\",\"m\",\"\")","v":"m"},{"$f":"IF(AND($S$34>0,S34<>\"?\",S34<>\"\"),\"negativa, recomenda-se prever um\",\"\")","v":""}]
[null,null,{"$f":"\"Previsão: func. mais crítico em caudal (\"&'Cálc. Sist. Extinção Automática'!$AU$6&\" Sprinklers)\"","v":"Previsão: func. mais crítico em caudal (12 Sprinklers)"},null,null,null,null,null,null,null,null,null,null,null,null,null,null,null,{"$f":"IF('Cálc. Sist. Extinção Automática'!AR7=\"\",\"\",'Cálc. Sist. Extinção Automática'!AR7)","v":""},{"$f":"IF(S35<>\"\",\"m\",\"\")","v":""},{"$f":"IF(AND($S$34>0,S34<>\"?\",S34<>\"\"),\"sistema automático de ferragem.\",\"\")","v":""}]
[null,null,"Ptotal","Qmáx.",null,null,null,null,{"$f":"IF('Cálc. Sist. Extinção Automática'!BA6=\"\",\"\",'Cálc. Sist. Extinção Automática'!BA6)","v":""},null,null,null,null,{"$f":"IF('Cálc. Sist. Extinção Automática'!AY5=\"\",\"\",'Cálc. Sist. Extinção Automática'!AY5)","v":""}]
[null,null,{"$f":"C16","v":"kPa"},{"$f":"D16","v":"l/min"}]
[null,null,{"$f":"IF('Cálc. Sist. Extinção Automática'!AU14=0,\"\",T123)","v":""},{"$f":"IF('Cálc. Sist. Extinção Automática'!AU14=0,\"\",T124)","v":""}]
[null,null,{"$f":"\"Ponto de funcionamento mais crítico\"&\" (\"&'Cálc. Sist. Extinção Automática'!$AU$6&\" Sprinklers)\"","v":"Ponto de funcionamento mais crítico (12 Sprinklers)"}]
[null,null,"Curvas da instalação mais críticas em pressão"]
[null,null,"Curvas da instalação menos críticas em pressão"]
[null,null,"Curva prevista da fonte de pressão"]
[null,null,"Limites da curva da fonte de pressão",null,null,null,null,null,null,null,null,null,null,"Volumereservatório =",{"$f":"IF('Cálc. Sist. Extinção Automática'!AU18=0,\"?\",'Cálc. Sist. Extinção Automática'!AU18)","v":"?"},"m³"]
[]
[]
[]
[null,null,null,null,null,null,null,null,null,null,null,null,null,null,null,null,null,null,null,null,null,null,"Curva menos crítica (com total de Sprinklers em simultâneo)",null,null,null,null,null,null,null,null,null,null,null,null,null,"Curva menos crítica (com apenas 1 Sprinkler em simultâneo)"]
[null,"Análise da situação menos crítica:",null,null,null,null,null,null,null,null,null,null,"Necessidade de pressão - Abastecimento:","Pi máx. =",{"$f":"IF(AH48=\"\",\"? \"&M57,ROUND(AH48,'Cálc. Sist. Extinção Automática'!$BM$5)&\" \"&$M$57)","v":"? kPa"},null,null,null,null,null,null,null,"Análise alternativa:",null,null,null,null,null,null,null,null,"Necessidade de pressão - Abastecimento:",null,{"$f":"IF($C$24=\"\",\"\",SUM(AH49+AH50+AH51))","v":""},null,null,null,null,null,null,null,"Necessidade de pressão - Abastecimento:",null,{"$f":"IF($C$24=\"\",\"\",SUM(AR49+AR50+AR51))","v":""}]
[null,null,null,null,null,null,null,null,null,null,null,null,"Pressão dinâmica no sprinkler mais desfavorável:","Pmín.S =",{"$f":"IF(AH49=\"\",\"? \"&M57,ROUND(AH49,'Cálc. Sist. Extinção Automática'!$BM$5)&\" \"&$M$57)","v":"56,3 kPa"},null,null,null,null,null,null,null,null,"Local.","ΔPest.",null,null,null,null,null,null,"Pressão dinâmica no sprinkler mais desfavorável:",null,{"$f":"'Cálc. Sist. Extinção Automática'!AU9","v":56.25},null,null,null,null,null,null,null,"Pressão dinâmica no sprinkler mais desfavorável:",null,{"$f":"'Cálc. Sist. Extinção Automática'!AU9","v":56.25}]
[null,null,{"$f":"IF(C24=\"\",\"\",C24)","v":""}," Identificação do nó de derivação",null,null,null,null,null,null,null,null,"Perda de carga total nos troços críticos relevantes:","ΔPc1 =",{"$f":"IF(AH50=\"\",\"? \"&M57,ROUND(AH50,'Cálc. Sist. Extinção Automática'!$BM$5)&\" \"&$M$57)","v":"? kPa"},null,null,null,null,null,null,null,{"$f":"C50","v":""},{"$f":"IFERROR(MATCH($C$24,'Cálc. Sist. Extinção Automática'!FG141:FG165,0),\"\")","v":""},{"$f":"IF($X$50=\"\",\"\",LOOKUP($X$50,'Cálc. Sist. Extinção Automática'!EY141:EY165,'Cálc. Sist. Extinção Automática'!FE141:FE165))","v":""},{"$f":"C16","v":"kPa"},null,null,null,null,null,"Perda de carga nos troços críticos relevantes:",{"$f":"IF($C$24=\"\",\"\",AI72)","v":""},{"$f":"IF($C$24=\"\",\"\",AG72)","v":""},null,null,null,null,null,null,null,"Perda de carga nos troços relevantes:",{"$f":"IF($C$24=\"\",\"\",AI72)","v":""},{"$f":"IF($C$24=\"\",\"\",AO72)","v":""}]
[null,null,null,null,null,null,null,null,null,null,null,null,"Perda de carga total nos troços abaixo detalhados:","ΔPc2 =",{"$f":"IF(AH51=\"\",\"? \"&M57,ROUND(AH51,'Cálc. Sist. Extinção Automática'!$BM$5)&\" \"&$M$57)","v":"? kPa"},null,null,null,null,null,null,null,null,"Local.","ΔPest.",null,null,null,null,null,null,"Perda de carga nos troços abaixo detalhados:",{"$f":"IF($C$24=\"\",\"\",N68)","v":""},{"$f":"IF($C$24=\"\",\"\",O68)","v":""},null,null,null,null,null,null,null,"Perda de carga nos troços abaixo detalhados:",{"$f":"IF($C$24=\"\",\"\",AQ68)","v":""},{"$f":"IF($C$24=\"\",\"\",AR68)","v":""}]
[null," Detalhes dos ramais a jusante do nó de derivação:",null,null,null,null,null,null,null,null,null,null,null,null,null,null,null,null,null,null,null,null,{"$f":"'Cálc. Sist. Extinção Automática'!ES168","v":""},{"$f":"IFERROR('Cálc. Sist. Extinção Automática'!ER168,\"\")","v":1},{"$f":"IF($X$52=\"\",\"\",LOOKUP($X$52,'Cálc. Sist. Extinção Automática'!EY141:EY165,'Cálc. Sist. Extinção Automática'!FE141:FE165))","v":0},{"$f":"Z50","v":"kPa"}]
[null,null,"0.2",null,"2.2","3.1","3.2","Quadro 2","3.4","4.3","5.1","5.2","7.2",null,"7.3",null,null,null,null,null,null,null,null,"Diferença:",{"$f":"IF(OR(Y50=\"\",Y52=\"\"),\"\",Y52-Y50)","v":""},{"$f":"Z52","v":"kPa"}]
[null,"Codificação",null,null,"Nº Sprink.",{"$f":"IF(CP100>=1,\" Erro: L não pode ser inferior a h\",\"Comprimentos dos troços\")","v":"Comprimentos dos troços"},null,null,null,"Caudais","Diâmetro",null,"Perdas de carga",null,null,null,null,null,null,null,null,null,null,"Decisão:",{"$f":"IF($Y$50<$AG$50,\"ok\",\"\")","v":""},"Diâmetros mínimos em função do nº total de sprinklers abastecidos e do nível de risco"]
[null,"dos troços",null,null,"total","real","altura","locais","equiv.","cálculo","imposto","interior","Dinâmica","Estática","Total",null,null,null,null,null,null,null,null,null,null,null,null,"Quadro 5",null,null,"Quadro 5",null,"troço"]
[null,"N","Início","Fim","NStroço","Lreal","h1)","Leq.Loc.","Leq.","Qtroço","Di imposto","Di","ΔPdinâmica","ΔPestática","ΔPtroço",null,null,null,null,null,null,null,"Di",null,null,null,null,"RGSCIE",null,null,"NFPA 13",null,"V ",null,null,null,"Qtroço",null,null,"V ",null,"ΔP","ΔPest.","ΔPc"]
[null,"nº",null,null,"nº","m","m","m","m",{"$f":"D16","v":"l/min"},"mm","mm",{"$f":"C16","v":"kPa"},{"$f":"M57","v":"kPa"},{"$f":"N57","v":"kPa"},null,null,null,null,null,null,null,"mm",null,null,null,"II","III, VI, VII e VIII","XII","Lig.","Ordin.","Graves","m/s",null,null,null,{"$f":"J57","v":"l/min"},null,null,"m/s",null,{"$f":"M57","v":"kPa"},{"$f":"AP57","v":"kPa"},{"$f":"AQ57","v":"kPa"}]
[null,{"$f":"IF(OR(C58=\"\",MAX('Cálc. Sist. Extinção Automática'!E25:E49)=0),\"\",MAX('Cálc. Sist. Extinção Automática'!E25:E49)+1)","v":""},{"$f":"IF(C24=\"\",\"\",C24)","v":""},null,null,null,null,null,{"$f":"IF(OR($C$58=\"\",F58=\"\"),\"\",IF(H58=\"\",F58*(1+'Cálc. Sist. Extinção Automática'!$P$14),F58+H58))","v":""},{"$f":"IF(OR($C$58=\"\",F58=\"\"),\"\",MAX('Cálc. Sist. Extinção Automática'!$R$25:$R$49))","v":""},null,{"$f":"IF(OR($C$58=\"\",D58=\"\",W58=\"\"),\"\",W58)","v":""},{"$f":"IF(OR('Cálc. Sist. Extinção Automática'!$P$16=\"\",J58=\"\",L58=\"\",$C$58=\"\"),\"\",IF('Cálc. Sist. Extinção Automática'!$M$15=\"\",'Cálc. Sist. Extinção Automática'!$B$18*'Cálc. Sist. Extinção Automática'!$AU$19*I58*61.7*100000*((J58/'Cálc. Sist. Extinção Automática'!$B$17)^1.85/('Cálc. Sist. Extinção Automática'!$P$16^1.85*L58^4.87)),'Cálc. Sist. Extinção Automática'!$B$18*'Cálc. Sist. Extinção Automática'!$AU$19*I58*((4*'Cálc. Sist. Extinção Automática'!$P$16*((AG58^7)/(L58/1000))^(1/4))/(L58/1000))))","v":""},{"$f":"IF(OR($C$58=\"\",G58=\"\",G58=0),\"\",G58*'Cálc. Sist. Extinção Automática'!$AU$19*'Cálc. Sist. Extinção Automática'!$B$18)","v":""},{"$f":"IF(AND(M58=\"\",N58=\"\"),\"\",IF(N58=\"\",M58,(M58+N58)))","v":""},null,null,null,null,null,null,null,{"$f":"IF(MAX(X58,Y58)=0,\"\",MAX(X58,Y58))","v":""},{"$f":"IF(K58=\"\",\"\",IF($K58<='Quadro 1'!$G$10,'Quadro 1'!$G$10,IF($K58<='Quadro 1'!$G$11,'Quadro 1'!$G$11,IF($K58<='Quadro 1'!$G$12,'Quadro 1'!$G$12,IF($K58<='Quadro 1'!$G$13,'Quadro 1'!$G$13,IF($K58<='Quadro 1'!$G$14,'Quadro 1'!$G$14,IF($K58<='Quadro 1'!$G$15,'Quadro 1'!$G$15,IF($K58<='Quadro 1'!$G$16,'Quadro 1'!$G$16,IF($K58<='Quadro 1'!$G$17,'Quadro 1'!$G$17,IF($K58<='Quadro 1'!$G$18,'Quadro 1'!$G$18,IF($K58<='Quadro 1'!$G$19,'Quadro 1'!$G$19,IF($K58<='Quadro 1'!$G$20,'Quadro 1'!$G$20,IF($K58<='Quadro 1'!$G$21,'Quadro 1'!$G$21,IF($K58<='Quadro 1'!$G$22,'Quadro 1'!$G$22,IF($K58<='Quadro 1'!$G$23,'Quadro 1'!$G$23,'Quadro 1'!$G$23)))))))))))))))","v":""},{"$f":"IF(C58=\"\",\"\",IF(AND('Cálc. Sist. Extinção Automática'!$A$5>=1,'Cálc. Sist. Extinção Automática'!$A$5<=7,MAX($AD58:$AF58)=0),\"\",IF(AND('Cálc. Sist. Extinção Automática'!$A$5>=1,'Cálc. Sist. Extinção Automática'!$A$5<=7),MAX($AD58:$AF58),IF(AND('Cálc. Sist. Extinção Automática'!$A$5>=11,'Cálc. Sist. Extinção Automática'!$A$5<=18),MAX($AA58:$AC58),IF('Cálc. Sist. Extinção Automática'!$A$5=8,$AA58,IF('Cálc. Sist. Extinção Automática'!$A$5=9,$AB58,IF('Cálc. Sist. Extinção Automática'!$A$5=10,$AC58,\"\")))))))","v":""},{"$f":"E58","v":0},{"$f":"IF($Z58<=2,27.3,IF($Z58<=3,36,IF($Z58<=5,41.9,IF($Z58<=10,53.1,IF($Z58<=20,68.9,IF($Z58<=30,80.9,IF($Z58<=40,105.3,IF($Z58<=60,129.7,155.1))))))))","v":27.3},27.3,{"$f":"IF($Z58=1,27.3,IF($Z58<=2,36,IF($Z58<=3,41.9,IF($Z58<=5,53.1,IF($Z58<=8,68.9,IF($Z58<=15,80.9,IF($Z58<=30,105.3,IF($Z58<=40,129.7,155.1))))))))","v":36},{"$f":"IF(OR('Cálc. Sist. Extinção Automática'!$A$5<>1,$B58=\"\"),\"\",IF($Z58<=2,27.3,IF($Z58<=3,36,IF($Z58<=5,41.9,IF($Z58<=10,53.1,IF($Z58<=30,68.9,IF($Z58<=60,80.9,IF($Z58<=100,105.3,129.7))))))))","v":""},{"$f":"IF(OR(AND('Cálc. Sist. Extinção Automática'!$A$5<>2,'Cálc. Sist. Extinção Automática'!$A$5<>3,'Cálc. Sist. Extinção Automática'!$A$5<>4),$B58=\"\"),\"\",IF($Z58<=2,27.3,IF($Z58<=3,36,IF($Z58<=5,41.9,IF($Z58<=10,53.1,IF($Z58<=20,68.9,IF($Z58<=40,80.9,IF($Z58<=100,105.3,129.7))))))))","v":""},{"$f":"IF(OR(AND('Cálc. Sist. Extinção Automática'!$A$5<>5,'Cálc. Sist. Extinção Automática'!$A$5<>6),$B58=\"\"),\"\",IF($Z58<=1,27.3,IF($Z58<=2,36,IF($Z58<=5,41.9,IF($Z58<=8,53.1,IF($Z58<=15,68.9,IF($Z58<=27,80.9,IF($Z58<=55,105.3,129.7))))))))","v":""},{"$f":"IF(OR(J58=\"\",L58=\"\"),\"\",(66.7*J58/'Cálc. Sist. Extinção Automática'!$B$17)/(PI()*W58^2))","v":""},null,null,null,{"$f":"IF(I58=\"\",\"\",'Curvas da Instalação'!$D$22)","v":""},null,null,{"$f":"IF(AK58=\"\",\"\",(66.7*AK58/'Cálc. Sist. Extinção Automática'!$B$17)/(PI()*L58^2))","v":""},null,{"$f":"IF(AK58=\"\",\"\",IF('Cálc. Sist. Extinção Automática'!$M$15=\"\",'Cálc. Sist. Extinção Automática'!$B$18*'Cálc. Sist. Extinção Automática'!$AU$19*I58*61.7*100000*((AK58/'Cálc. Sist. Extinção Automática'!$B$17)^1.85/('Cálc. Sist. Extinção Automática'!$P$16^1.85*L58^4.87)),'Cálc. Sist. Extinção Automática'!$B$18*'Cálc. Sist. Extinção Automática'!$AU$19*I58*((4*'Cálc. Sist. Extinção Automática'!$P$16*((AN58^7)/(L58/1000))^(1/4))/(L58/1000))))","v":""},{"$f":"IF(AK58=\"\",\"\",N58)","v":""},{"$f":"IF(AND(AP58=\"\",AQ58=\"\"),\"\",IF(AQ58=\"\",AP58,(AP58+AQ58)))","v":""}]
[null,{"$f":"IF(OR(B58=\"\",F59=\"\"),\"\",B58+1)","v":""},null,null,null,null,null,null,{"$f":"IF(OR($C$58=\"\",F59=\"\"),\"\",IF(H59=\"\",F59*(1+'Cálc. Sist. Extinção Automática'!$P$14),F59+H59))","v":""},{"$f":"IF(OR($C$58=\"\",F59=\"\"),\"\",MAX('Cálc. Sist. Extinção Automática'!$R$25:$R$49))","v":""},null,{"$f":"IF(OR($C$58=\"\",W59=\"\"),\"\",W59)","v":""},{"$f":"IF(OR('Cálc. Sist. Extinção Automática'!$P$16=\"\",J59=\"\",L59=\"\",$C$58=\"\"),\"\",IF('Cálc. Sist. Extinção Automática'!$M$15=\"\",'Cálc. Sist. Extinção Automática'!$B$18*'Cálc. Sist. Extinção Automática'!$AU$19*I59*61.7*100000*((J59/'Cálc. Sist. Extinção Automática'!$B$17)^1.85/('Cálc. Sist. Extinção Automática'!$P$16^1.85*L59^4.87)),'Cálc. Sist. Extinção Automática'!$B$18*'Cálc. Sist. Extinção Automática'!$AU$19*I59*((4*'Cálc. Sist. Extinção Automática'!$P$16*((AG59^7)/(L59/1000))^(1/4))/(L59/1000))))","v":""},{"$f":"IF(OR($C$58=\"\",G59=\"\",G59=0),\"\",G59*'Cálc. Sist. Extinção Automática'!$AU$19*'Cálc. Sist. Extinção Automática'!$B$18)","v":""},{"$f":"IF(AND(M59=\"\",N59=\"\"),\"\",IF(N59=\"\",M59,(M59+N59)))","v":""},null,null,null,null,null,null,null,{"$f":"IF(MAX(X59,Y59)=0,\"\",MAX(X59,Y59))","v":""},{"$f":"IF(K59=\"\",\"\",IF($K59<='Quadro 1'!$G$10,'Quadro 1'!$G$10,IF($K59<='Quadro 1'!$G$11,'Quadro 1'!$G$11,IF($K59<='Quadro 1'!$G$12,'Quadro 1'!$G$12,IF($K59<='Quadro 1'!$G$13,'Quadro 1'!$G$13,IF($K59<='Quadro 1'!$G$14,'Quadro 1'!$G$14,IF($K59<='Quadro 1'!$G$15,'Quadro 1'!$G$15,IF($K59<='Quadro 1'!$G$16,'Quadro 1'!$G$16,IF($K59<='Quadro 1'!$G$17,'Quadro 1'!$G$17,IF($K59<='Quadro 1'!$G$18,'Quadro 1'!$G$18,IF($K59<='Quadro 1'!$G$19,'Quadro 1'!$G$19,IF($K59<='Quadro 1'!$G$20,'Quadro 1'!$G$20,IF($K59<='Quadro 1'!$G$21,'Quadro 1'!$G$21,IF($K59<='Quadro 1'!$G$22,'Quadro 1'!$G$22,IF($K59<='Quadro 1'!$G$23,'Quadro 1'!$G$23,'Quadro 1'!$G$23)))))))))))))))","v":""},{"$f":"IF(C59=\"\",\"\",IF(AND('Cálc. Sist. Extinção Automática'!$A$5>=1,'Cálc. Sist. Extinção Automática'!$A$5<=7,MAX($AD59:$AF59)=0),\"\",IF(AND('Cálc. Sist. Extinção Automática'!$A$5>=1,'Cálc. Sist. Extinção Automática'!$A$5<=7),MAX($AD59:$AF59),IF(AND('Cálc. Sist. Extinção Automática'!$A$5>=11,'Cálc. Sist. Extinção Automática'!$A$5<=18),MAX($AA59:$AC59),IF('Cálc. Sist. Extinção Automática'!$A$5=8,$AA59,IF('Cálc. Sist. Extinção Automática'!$A$5=9,$AB59,IF('Cálc. Sist. Extinção Automática'!$A$5=10,$AC59,\"\")))))))","v":""},0,27.3,27.3,36,{"$f":"IF(OR('Cálc. Sist. Extinção Automática'!$A$5<>1,$B59=\"\"),\"\",IF($Z59<=2,27.3,IF($Z59<=3,36,IF($Z59<=5,41.9,IF($Z59<=10,53.1,IF($Z59<=30,68.9,IF($Z59<=60,80.9,IF($Z59<=100,105.3,129.7))))))))","v":""},{"$f":"IF(OR(AND('Cálc. Sist. Extinção Automática'!$A$5<>2,'Cálc. Sist. Extinção Automática'!$A$5<>3,'Cálc. Sist. Extinção Automática'!$A$5<>4),$B59=\"\"),\"\",IF($Z59<=2,27.3,IF($Z59<=3,36,IF($Z59<=5,41.9,IF($Z59<=10,53.1,IF($Z59<=20,68.9,IF($Z59<=40,80.9,IF($Z59<=100,105.3,129.7))))))))","v":""},{"$f":"IF(OR(AND('Cálc. Sist. Extinção Automática'!$A$5<>5,'Cálc. Sist. Extinção Automática'!$A$5<>6),$B59=\"\"),\"\",IF($Z59<=1,27.3,IF($Z59<=2,36,IF($Z59<=5,41.9,IF($Z59<=8,53.1,IF($Z59<=15,68.9,IF($Z59<=27,80.9,IF($Z59<=55,105.3,129.7))))))))","v":""},{"$f":"IF(OR(J59=\"\",L59=\"\"),\"\",(66.7*J59/'Cálc. Sist. Extinção Automática'!$B$17)/(PI()*W59^2))","v":""},null,null,null,{"$f":"IF(I59=\"\",\"\",'Curvas da Instalação'!$D$22)","v":""},null,null,{"$f":"IF(AK59=\"\",\"\",(66.7*AK59/'Cálc. Sist. Extinção Automática'!$B$17)/(PI()*L59^2))","v":""},null,{"$f":"IF(AK59=\"\",\"\",IF('Cálc. Sist. Extinção Automática'!$M$15=\"\",'Cálc. Sist. Extinção Automática'!$B$18*'Cálc. Sist. Extinção Automática'!$AU$19*I59*61.7*100000*((AK59/'Cálc. Sist. Extinção Automática'!$B$17)^1.85/('Cálc. Sist. Extinção Automática'!$P$16^1.85*L59^4.87)),'Cálc. Sist. Extinção Automática'!$B$18*'Cálc. Sist. Extinção Automática'!$AU$19*I59*((4*'Cálc. Sist. Extinção Automática'!$P$16*((AN59^7)/(L59/1000))^(1/4))/(L59/1000))))","v":""},{"$f":"IF(AK59=\"\",\"\",N59)","v":""},{"$f":"IF(AND(AP59=\"\",AQ59=\"\"),\"\",IF(AQ59=\"\",AP59,(AP59+AQ59)))","v":""}]
[null,{"$f":"IF(OR(B59=\"\",F60=\"\"),\"\",B59+1)","v":""},null,null,null,null,null,null,{"$f":"IF(OR($C$58=\"\",F60=\"\"),\"\",IF(H60=\"\",F60*(1+'Cálc. Sist. Extinção Automática'!$P$14),F60+H60))","v":""},{"$f":"IF(OR($C$58=\"\",F60=\"\"),\"\",MAX('Cálc. Sist. Extinção Automática'!$R$25:$R$49))","v":""},null,"",{"$f":"IF(OR('Cálc. Sist. Extinção Automática'!$P$16=\"\",J60=\"\",L60=\"\",$C$58=\"\"),\"\",IF('Cálc. Sist. Extinção Automática'!$M$15=\"\",'Cálc. Sist. Extinção Automática'!$B$18*'Cálc. Sist. Extinção Automática'!$AU$19*I60*61.7*100000*((J60/'Cálc. Sist. Extinção Automática'!$B$17)^1.85/('Cálc. Sist. Extinção Automática'!$P$16^1.85*L60^4.87)),'Cálc. Sist. Extinção Automática'!$B$18*'Cálc. Sist. Extinção Automática'!$AU$19*I60*((4*'Cálc. Sist. Extinção Automática'!$P$16*((AG60^7)/(L60/1000))^(1/4))/(L60/1000))))","v":""},{"$f":"IF(OR($C$58=\"\",G60=\"\",G60=0),\"\",G60*'Cálc. Sist. Extinção Automática'!$AU$19*'Cálc. Sist. Extinção Automática'!$B$18)","v":""},"",null,null,null,null,null,null,null,"",{"$f":"IF(K60=\"\",\"\",IF($K60<='Quadro 1'!$G$10,'Quadro 1'!$G$10,IF($K60<='Quadro 1'!$G$11,'Quadro 1'!$G$11,IF($K60<='Quadro 1'!$G$12,'Quadro 1'!$G$12,IF($K60<='Quadro 1'!$G$13,'Quadro 1'!$G$13,IF($K60<='Quadro 1'!$G$14,'Quadro 1'!$G$14,IF($K60<='Quadro 1'!$G$15,'Quadro 1'!$G$15,IF($K60<='Quadro 1'!$G$16,'Quadro 1'!$G$16,IF($K60<='Quadro 1'!$G$17,'Quadro 1'!$G$17,IF($K60<='Quadro 1'!$G$18,'Quadro 1'!$G$18,IF($K60<='Quadro 1'!$G$19,'Quadro 1'!$G$19,IF($K60<='Quadro 1'!$G$20,'Quadro 1'!$G$20,IF($K60<='Quadro 1'!$G$21,'Quadro 1'!$G$21,IF($K60<='Quadro 1'!$G$22,'Quadro 1'!$G$22,IF($K60<='Quadro 1'!$G$23,'Quadro 1'!$G$23,'Quadro 1'!$G$23)))))))))))))))","v":""},{"$f":"IF(C60=\"\",\"\",IF(AND('Cálc. Sist. Extinção Automática'!$A$5>=1,'Cálc. Sist. Extinção Automática'!$A$5<=7,MAX($AD60:$AF60)=0),\"\",IF(AND('Cálc. Sist. Extinção Automática'!$A$5>=1,'Cálc. Sist. Extinção Automática'!$A$5<=7),MAX($AD60:$AF60),IF(AND('Cálc. Sist. Extinção Automática'!$A$5>=11,'Cálc. Sist. Extinção Automática'!$A$5<=18),MAX($AA60:$AC60),IF('Cálc. Sist. Extinção Automática'!$A$5=8,$AA60,IF('Cálc. Sist. Extinção Automática'!$A$5=9,$AB60,IF('Cálc. Sist. Extinção Automática'!$A$5=10,$AC60,\"\")))))))","v":""},0,27.3,27.3,36,{"$f":"IF(OR('Cálc. Sist. Extinção Automática'!$A$5<>1,$B60=\"\"),\"\",IF($Z60<=2,27.3,IF($Z60<=3,36,IF($Z60<=5,41.9,IF($Z60<=10,53.1,IF($Z60<=30,68.9,IF($Z60<=60,80.9,IF($Z60<=100,105.3,129.7))))))))","v":""},{"$f":"IF(OR(AND('Cálc. Sist. Extinção Automática'!$A$5<>2,'Cálc. Sist. Extinção Automática'!$A$5<>3,'Cálc. Sist. Extinção Automática'!$A$5<>4),$B60=\"\"),\"\",IF($Z60<=2,27.3,IF($Z60<=3,36,IF($Z60<=5,41.9,IF($Z60<=10,53.1,IF($Z60<=20,68.9,IF($Z60<=40,80.9,IF($Z60<=100,105.3,129.7))))))))","v":""},{"$f":"IF(OR(AND('Cálc. Sist. Extinção Automática'!$A$5<>5,'Cálc. Sist. Extinção Automática'!$A$5<>6),$B60=\"\"),\"\",IF($Z60<=1,27.3,IF($Z60<=2,36,IF($Z60<=5,41.9,IF($Z60<=8,53.1,IF($Z60<=15,68.9,IF($Z60<=27,80.9,IF($Z60<=55,105.3,129.7))))))))","v":""},{"$f":"IF(OR(J60=\"\",L60=\"\"),\"\",(66.7*J60/'Cálc. Sist. Extinção Automática'!$B$17)/(PI()*W60^2))","v":""},null,null,null,{"$f":"IF(I60=\"\",\"\",'Curvas da Instalação'!$D$22)","v":""},null,null,{"$f":"IF(AK60=\"\",\"\",(66.7*AK60/'Cálc. Sist. Extinção Automática'!$B$17)/(PI()*L60^2))","v":""},null,{"$f":"IF(AK60=\"\",\"\",IF('Cálc. Sist. Extinção Automática'!$M$15=\"\",'Cálc. Sist. Extinção Automática'!$B$18*'Cálc. Sist. Extinção Automática'!$AU$19*I60*61.7*100000*((AK60/'Cálc. Sist. Extinção Automática'!$B$17)^1.85/('Cálc. Sist. Extinção Automática'!$P$16^1.85*L60^4.87)),'Cálc. Sist. Extinção Automática'!$B$18*'Cálc. Sist. Extinção Automática'!$AU$19*I60*((4*'Cálc. Sist. Extinção Automática'!$P$16*((AN60^7)/(L60/1000))^(1/4))/(L60/1000))))","v":""},"",""]
[null,"",null,null,null,null,null,null,{"$f":"IF(OR($C$58=\"\",F61=\"\"),\"\",IF(H61=\"\",F61*(1+'Cálc. Sist. Extinção Automática'!$P$14),F61+H61))","v":""},{"$f":"IF(OR($C$58=\"\",F61=\"\"),\"\",MAX('Cálc. Sist. Extinção Automática'!$R$25:$R$49))","v":""},null,"",{"$f":"IF(OR('Cálc. Sist. Extinção Automática'!$P$16=\"\",J61=\"\",L61=\"\",$C$58=\"\"),\"\",IF('Cálc. Sist. Extinção Automática'!$M$15=\"\",'Cálc. Sist. Extinção Automática'!$B$18*'Cálc. Sist. Extinção Automática'!$AU$19*I61*61.7*100000*((J61/'Cálc. Sist. Extinção Automática'!$B$17)^1.85/('Cálc. Sist. Extinção Automática'!$P$16^1.85*L61^4.87)),'Cálc. Sist. Extinção Automática'!$B$18*'Cálc. Sist. Extinção Automática'!$AU$19*I61*((4*'Cálc. Sist. Extinção Automática'!$P$16*((AG61^7)/(L61/1000))^(1/4))/(L61/1000))))","v":""},{"$f":"IF(OR($C$58=\"\",G61=\"\",G61=0),\"\",G61*'Cálc. Sist. Extinção Automática'!$AU$19*'Cálc. Sist. Extinção Automática'!$B$18)","v":""},"",null,null,null,null,null,null,null,"",{"$f":"IF(K61=\"\",\"\",IF($K61<='Quadro 1'!$G$10,'Quadro 1'!$G$10,IF($K61<='Quadro 1'!$G$11,'Quadro 1'!$G$11,IF($K61<='Quadro 1'!$G$12,'Quadro 1'!$G$12,IF($K61<='Quadro 1'!$G$13,'Quadro 1'!$G$13,IF($K61<='Quadro 1'!$G$14,'Quadro 1'!$G$14,IF($K61<='Quadro 1'!$G$15,'Quadro 1'!$G$15,IF($K61<='Quadro 1'!$G$16,'Quadro 1'!$G$16,IF($K61<='Quadro 1'!$G$17,'Quadro 1'!$G$17,IF($K61<='Quadro 1'!$G$18,'Quadro 1'!$G$18,IF($K61<='Quadro 1'!$G$19,'Quadro 1'!$G$19,IF($K61<='Quadro 1'!$G$20,'Quadro 1'!$G$20,IF($K61<='Quadro 1'!$G$21,'Quadro 1'!$G$21,IF($K61<='Quadro 1'!$G$22,'Quadro 1'!$G$22,IF($K61<='Quadro 1'!$G$23,'Quadro 1'!$G$23,'Quadro 1'!$G$23)))))))))))))))","v":""},{"$f":"IF(C61=\"\",\"\",IF(AND('Cálc. Sist. Extinção Automática'!$A$5>=1,'Cálc. Sist. Extinção Automática'!$A$5<=7,MAX($AD61:$AF61)=0),\"\",IF(AND('Cálc. Sist. Extinção Automática'!$A$5>=1,'Cálc. Sist. Extinção Automática'!$A$5<=7),MAX($AD61:$AF61),IF(AND('Cálc. Sist. Extinção Automática'!$A$5>=11,'Cálc. Sist. Extinção Automática'!$A$5<=18),MAX($AA61:$AC61),IF('Cálc. Sist. Extinção Automática'!$A$5=8,$AA61,IF('Cálc. Sist. Extinção Automática'!$A$5=9,$AB61,IF('Cálc. Sist. Extinção Automática'!$A$5=10,$AC61,\"\")))))))","v":""},0,27.3,27.3,36,{"$f":"IF(OR('Cálc. Sist. Extinção Automática'!$A$5<>1,$B61=\"\"),\"\",IF($Z61<=2,27.3,IF($Z61<=3,36,IF($Z61<=5,41.9,IF($Z61<=10,53.1,IF($Z61<=30,68.9,IF($Z61<=60,80.9,IF($Z61<=100,105.3,129.7))))))))","v":""},{"$f":"IF(OR(AND('Cálc. Sist. Extinção Automática'!$A$5<>2,'Cálc. Sist. Extinção Automática'!$A$5<>3,'Cálc. Sist. Extinção Automática'!$A$5<>4),$B61=\"\"),\"\",IF($Z61<=2,27.3,IF($Z61<=3,36,IF($Z61<=5,41.9,IF($Z61<=10,53.1,IF($Z61<=20,68.9,IF($Z61<=40,80.9,IF($Z61<=100,105.3,129.7))))))))","v":""},{"$f":"IF(OR(AND('Cálc. Sist. Extinção Automática'!$A$5<>5,'Cálc. Sist. Extinção Automática'!$A$5<>6),$B61=\"\"),\"\",IF($Z61<=1,27.3,IF($Z61<=2,36,IF($Z61<=5,41.9,IF($Z61<=8,53.1,IF($Z61<=15,68.9,IF($Z61<=27,80.9,IF($Z61<=55,105.3,129.7))))))))","v":""},{"$f":"IF(OR(J61=\"\",L61=\"\"),\"\",(66.7*J61/'Cálc. Sist. Extinção Automática'!$B$17)/(PI()*W61^2))","v":""},null,null,null,{"$f":"IF(I61=\"\",\"\",'Curvas da Instalação'!$D$22)","v":""},null,null,{"$f":"IF(AK61=\"\",\"\",(66.7*AK61/'Cálc. Sist. Extinção Automática'!$B$17)/(PI()*L61^2))","v":""},null,{"$f":"IF(AK61=\"\",\"\",IF('Cálc. Sist. Extinção Automática'!$M$15=\"\",'Cálc. Sist. Extinção Automática'!$B$18*'Cálc. Sist. Extinção Automática'!$AU$19*I61*61.7*100000*((AK61/'Cálc. Sist. Extinção Automática'!$B$17)^1.85/('Cálc. Sist. Extinção Automática'!$P$16^1.85*L61^4.87)),'Cálc. Sist. Extinção Automática'!$B$18*'Cálc. Sist. Extinção Automática'!$AU$19*I61*((4*'Cálc. Sist. Extinção Automática'!$P$16*((AN61^7)/(L61/1000))^(1/4))/(L61/1000))))","v":""},"",""]
[null,"",null,null,null,null,null,null,{"$f":"IF(OR($C$58=\"\",F62=\"\"),\"\",IF(H62=\"\",F62*(1+'Cálc. Sist. Extinção Automática'!$P$14),F62+H62))","v":""},{"$f":"IF(OR($C$58=\"\",F62=\"\"),\"\",MAX('Cálc. Sist. Extinção Automática'!$R$25:$R$49))","v":""},null,"",{"$f":"IF(OR('Cálc. Sist. Extinção Automática'!$P$16=\"\",J62=\"\",L62=\"\",$C$58=\"\"),\"\",IF('Cálc. Sist. Extinção Automática'!$M$15=\"\",'Cálc. Sist. Extinção Automática'!$B$18*'Cálc. Sist. Extinção Automática'!$AU$19*I62*61.7*100000*((J62/'Cálc. Sist. Extinção Automática'!$B$17)^1.85/('Cálc. Sist. Extinção Automática'!$P$16^1.85*L62^4.87)),'Cálc. Sist. Extinção Automática'!$B$18*'Cálc. Sist. Extinção Automática'!$AU$19*I62*((4*'Cálc. Sist. Extinção Automática'!$P$16*((AG62^7)/(L62/1000))^(1/4))/(L62/1000))))","v":""},{"$f":"IF(OR($C$58=\"\",G62=\"\",G62=0),\"\",G62*'Cálc. Sist. Extinção Automática'!$AU$19*'Cálc. Sist. Extinção Automática'!$B$18)","v":""},"",null,null,null,null,null,null,null,"",{"$f":"IF(K62=\"\",\"\",IF($K62<='Quadro 1'!$G$10,'Quadro 1'!$G$10,IF($K62<='Quadro 1'!$G$11,'Quadro 1'!$G$11,IF($K62<='Quadro 1'!$G$12,'Quadro 1'!$G$12,IF($K62<='Quadro 1'!$G$13,'Quadro 1'!$G$13,IF($K62<='Quadro 1'!$G$14,'Quadro 1'!$G$14,IF($K62<='Quadro 1'!$G$15,'Quadro 1'!$G$15,IF($K62<='Quadro 1'!$G$16,'Quadro 1'!$G$16,IF($K62<='Quadro 1'!$G$17,'Quadro 1'!$G$17,IF($K62<='Quadro 1'!$G$18,'Quadro 1'!$G$18,IF($K62<='Quadro 1'!$G$19,'Quadro 1'!$G$19,IF($K62<='Quadro 1'!$G$20,'Quadro 1'!$G$20,IF($K62<='Quadro 1'!$G$21,'Quadro 1'!$G$21,IF($K62<='Quadro 1'!$G$22,'Quadro 1'!$G$22,IF($K62<='Quadro 1'!$G$23,'Quadro 1'!$G$23,'Quadro 1'!$G$23)))))))))))))))","v":""},{"$f":"IF(C62=\"\",\"\",IF(AND('Cálc. Sist. Extinção Automática'!$A$5>=1,'Cálc. Sist. Extinção Automática'!$A$5<=7,MAX($AD62:$AF62)=0),\"\",IF(AND('Cálc. Sist. Extinção Automática'!$A$5>=1,'Cálc. Sist. Extinção Automática'!$A$5<=7),MAX($AD62:$AF62),IF(AND('Cálc. Sist. Extinção Automática'!$A$5>=11,'Cálc. Sist. Extinção Automática'!$A$5<=18),MAX($AA62:$AC62),IF('Cálc. Sist. Extinção Automática'!$A$5=8,$AA62,IF('Cálc. Sist. Extinção Automática'!$A$5=9,$AB62,IF('Cálc. Sist. Extinção Automática'!$A$5=10,$AC62,\"\")))))))","v":""},0,27.3,27.3,36,{"$f":"IF(OR('Cálc. Sist. Extinção Automática'!$A$5<>1,$B62=\"\"),\"\",IF($Z62<=2,27.3,IF($Z62<=3,36,IF($Z62<=5,41.9,IF($Z62<=10,53.1,IF($Z62<=30,68.9,IF($Z62<=60,80.9,IF($Z62<=100,105.3,129.7))))))))","v":""},{"$f":"IF(OR(AND('Cálc. Sist. Extinção Automática'!$A$5<>2,'Cálc. Sist. Extinção Automática'!$A$5<>3,'Cálc. Sist. Extinção Automática'!$A$5<>4),$B62=\"\"),\"\",IF($Z62<=2,27.3,IF($Z62<=3,36,IF($Z62<=5,41.9,IF($Z62<=10,53.1,IF($Z62<=20,68.9,IF($Z62<=40,80.9,IF($Z62<=100,105.3,129.7))))))))","v":""},{"$f":"IF(OR(AND('Cálc. Sist. Extinção Automática'!$A$5<>5,'Cálc. Sist. Extinção Automática'!$A$5<>6),$B62=\"\"),\"\",IF($Z62<=1,27.3,IF($Z62<=2,36,IF($Z62<=5,41.9,IF($Z62<=8,53.1,IF($Z62<=15,68.9,IF($Z62<=27,80.9,IF($Z62<=55,105.3,129.7))))))))","v":""},{"$f":"IF(OR(J62=\"\",L62=\"\"),\"\",(66.7*J62/'Cálc. Sist. Extinção Automática'!$B$17)/(PI()*W62^2))","v":""},null,null,null,{"$f":"IF(I62=\"\",\"\",'Curvas da Instalação'!$D$22)","v":""},null,null,{"$f":"IF(AK62=\"\",\"\",(66.7*AK62/'Cálc. Sist. Extinção Automática'!$B$17)/(PI()*L62^2))","v":""},null,{"$f":"IF(AK62=\"\",\"\",IF('Cálc. Sist. Extinção Automática'!$M$15=\"\",'Cálc. Sist. Extinção Automática'!$B$18*'Cálc. Sist. Extinção Automática'!$AU$19*I62*61.7*100000*((AK62/'Cálc. Sist. Extinção Automática'!$B$17)^1.85/('Cálc. Sist. Extinção Automática'!$P$16^1.85*L62^4.87)),'Cálc. Sist. Extinção Automática'!$B$18*'Cálc. Sist. Extinção Automática'!$AU$19*I62*((4*'Cálc. Sist. Extinção Automática'!$P$16*((AN62^7)/(L62/1000))^(1/4))/(L62/1000))))","v":""},"",""]
[null,"",null,null,null,null,null,null,{"$f":"IF(OR($C$58=\"\",F63=\"\"),\"\",IF(H63=\"\",F63*(1+'Cálc. Sist. Extinção Automática'!$P$14),F63+H63))","v":""},{"$f":"IF(OR($C$58=\"\",F63=\"\"),\"\",MAX('Cálc. Sist. Extinção Automática'!$R$25:$R$49))","v":""},null,"",{"$f":"IF(OR('Cálc. Sist. Extinção Automática'!$P$16=\"\",J63=\"\",L63=\"\",$C$58=\"\"),\"\",IF('Cálc. Sist. Extinção Automática'!$M$15=\"\",'Cálc. Sist. Extinção Automática'!$B$18*'Cálc. Sist. Extinção Automática'!$AU$19*I63*61.7*100000*((J63/'Cálc. Sist. Extinção Automática'!$B$17)^1.85/('Cálc. Sist. Extinção Automática'!$P$16^1.85*L63^4.87)),'Cálc. Sist. Extinção Automática'!$B$18*'Cálc. Sist. Extinção Automática'!$AU$19*I63*((4*'Cálc. Sist. Extinção Automática'!$P$16*((AG63^7)/(L63/1000))^(1/4))/(L63/1000))))","v":""},{"$f":"IF(OR($C$58=\"\",G63=\"\",G63=0),\"\",G63*'Cálc. Sist. Extinção Automática'!$AU$19*'Cálc. Sist. Extinção Automática'!$B$18)","v":""},"",null,null,null,null,null,null,null,"",{"$f":"IF(K63=\"\",\"\",IF($K63<='Quadro 1'!$G$10,'Quadro 1'!$G$10,IF($K63<='Quadro 1'!$G$11,'Quadro 1'!$G$11,IF($K63<='Quadro 1'!$G$12,'Quadro 1'!$G$12,IF($K63<='Quadro 1'!$G$13,'Quadro 1'!$G$13,IF($K63<='Quadro 1'!$G$14,'Quadro 1'!$G$14,IF($K63<='Quadro 1'!$G$15,'Quadro 1'!$G$15,IF($K63<='Quadro 1'!$G$16,'Quadro 1'!$G$16,IF($K63<='Quadro 1'!$G$17,'Quadro 1'!$G$17,IF($K63<='Quadro 1'!$G$18,'Quadro 1'!$G$18,IF($K63<='Quadro 1'!$G$19,'Quadro 1'!$G$19,IF($K63<='Quadro 1'!$G$20,'Quadro 1'!$G$20,IF($K63<='Quadro 1'!$G$21,'Quadro 1'!$G$21,IF($K63<='Quadro 1'!$G$22,'Quadro 1'!$G$22,IF($K63<='Quadro 1'!$G$23,'Quadro 1'!$G$23,'Quadro 1'!$G$23)))))))))))))))","v":""},{"$f":"IF(C63=\"\",\"\",IF(AND('Cálc. Sist. Extinção Automática'!$A$5>=1,'Cálc. Sist. Extinção Automática'!$A$5<=7,MAX($AD63:$AF63)=0),\"\",IF(AND('Cálc. Sist. Extinção Automática'!$A$5>=1,'Cálc. Sist. Extinção Automática'!$A$5<=7),MAX($AD63:$AF63),IF(AND('Cálc. Sist. Extinção Automática'!$A$5>=11,'Cálc. Sist. Extinção Automática'!$A$5<=18),MAX($AA63:$AC63),IF('Cálc. Sist. Extinção Automática'!$A$5=8,$AA63,IF('Cálc. Sist. Extinção Automática'!$A$5=9,$AB63,IF('Cálc. Sist. Extinção Automática'!$A$5=10,$AC63,\"\")))))))","v":""},0,27.3,27.3,36,{"$f":"IF(OR('Cálc. Sist. Extinção Automática'!$A$5<>1,$B63=\"\"),\"\",IF($Z63<=2,27.3,IF($Z63<=3,36,IF($Z63<=5,41.9,IF($Z63<=10,53.1,IF($Z63<=30,68.9,IF($Z63<=60,80.9,IF($Z63<=100,105.3,129.7))))))))","v":""},{"$f":"IF(OR(AND('Cálc. Sist. Extinção Automática'!$A$5<>2,'Cálc. Sist. Extinção Automática'!$A$5<>3,'Cálc. Sist. Extinção Automática'!$A$5<>4),$B63=\"\"),\"\",IF($Z63<=2,27.3,IF($Z63<=3,36,IF($Z63<=5,41.9,IF($Z63<=10,53.1,IF($Z63<=20,68.9,IF($Z63<=40,80.9,IF($Z63<=100,105.3,129.7))))))))","v":""},{"$f":"IF(OR(AND('Cálc. Sist. Extinção Automática'!$A$5<>5,'Cálc. Sist. Extinção Automática'!$A$5<>6),$B63=\"\"),\"\",IF($Z63<=1,27.3,IF($Z63<=2,36,IF($Z63<=5,41.9,IF($Z63<=8,53.1,IF($Z63<=15,68.9,IF($Z63<=27,80.9,IF($Z63<=55,105.3,129.7))))))))","v":""},{"$f":"IF(OR(J63=\"\",L63=\"\"),\"\",(66.7*J63/'Cálc. Sist. Extinção Automática'!$B$17)/(PI()*W63^2))","v":""},null,null,null,{"$f":"IF(I63=\"\",\"\",'Curvas da Instalação'!$D$22)","v":""},null,null,{"$f":"IF(AK63=\"\",\"\",(66.7*AK63/'Cálc. Sist. Extinção Automática'!$B$17)/(PI()*L63^2))","v":""},null,{"$f":"IF(AK63=\"\",\"\",IF('Cálc. Sist. Extinção Automática'!$M$15=\"\",'Cálc. Sist. Extinção Automática'!$B$18*'Cálc. Sist. Extinção Automática'!$AU$19*I63*61.7*100000*((AK63/'Cálc. Sist. Extinção Automática'!$B$17)^1.85/('Cálc. Sist. Extinção Automática'!$P$16^1.85*L63^4.87)),'Cálc. Sist. Extinção Automática'!$B$18*'Cálc. Sist. Extinção Automática'!$AU$19*I63*((4*'Cálc. Sist. Extinção Automática'!$P$16*((AN63^7)/(L63/1000))^(1/4))/(L63/1000))))","v":""},"",""]
[null,"",null,null,null,null,null,null,{"$f":"IF(OR($C$58=\"\",F64=\"\"),\"\",IF(H64=\"\",F64*(1+'Cálc. Sist. Extinção Automática'!$P$14),F64+H64))","v":""},{"$f":"IF(OR($C$58=\"\",F64=\"\"),\"\",MAX('Cálc. Sist. Extinção Automática'!$R$25:$R$49))","v":""},null,"",{"$f":"IF(OR('Cálc. Sist. Extinção Automática'!$P$16=\"\",J64=\"\",L64=\"\",$C$58=\"\"),\"\",IF('Cálc. Sist. Extinção Automática'!$M$15=\"\",'Cálc. Sist. Extinção Automática'!$B$18*'Cálc. Sist. Extinção Automática'!$AU$19*I64*61.7*100000*((J64/'Cálc. Sist. Extinção Automática'!$B$17)^1.85/('Cálc. Sist. Extinção Automática'!$P$16^1.85*L64^4.87)),'Cálc. Sist. Extinção Automática'!$B$18*'Cálc. Sist. Extinção Automática'!$AU$19*I64*((4*'Cálc. Sist. Extinção Automática'!$P$16*((AG64^7)/(L64/1000))^(1/4))/(L64/1000))))","v":""},{"$f":"IF(OR($C$58=\"\",G64=\"\",G64=0),\"\",G64*'Cálc. Sist. Extinção Automática'!$AU$19*'Cálc. Sist. Extinção Automática'!$B$18)","v":""},"",null,null,null,null,null,null,null,"",{"$f":"IF(K64=\"\",\"\",IF($K64<='Quadro 1'!$G$10,'Quadro 1'!$G$10,IF($K64<='Quadro 1'!$G$11,'Quadro 1'!$G$11,IF($K64<='Quadro 1'!$G$12,'Quadro 1'!$G$12,IF($K64<='Quadro 1'!$G$13,'Quadro 1'!$G$13,IF($K64<='Quadro 1'!$G$14,'Quadro 1'!$G$14,IF($K64<='Quadro 1'!$G$15,'Quadro 1'!$G$15,IF($K64<='Quadro 1'!$G$16,'Quadro 1'!$G$16,IF($K64<='Quadro 1'!$G$17,'Quadro 1'!$G$17,IF($K64<='Quadro 1'!$G$18,'Quadro 1'!$G$18,IF($K64<='Quadro 1'!$G$19,'Quadro 1'!$G$19,IF($K64<='Quadro 1'!$G$20,'Quadro 1'!$G$20,IF($K64<='Quadro 1'!$G$21,'Quadro 1'!$G$21,IF($K64<='Quadro 1'!$G$22,'Quadro 1'!$G$22,IF($K64<='Quadro 1'!$G$23,'Quadro 1'!$G$23,'Quadro 1'!$G$23)))))))))))))))","v":""},{"$f":"IF(C64=\"\",\"\",IF(AND('Cálc. Sist. Extinção Automática'!$A$5>=1,'Cálc. Sist. Extinção Automática'!$A$5<=7,MAX($AD64:$AF64)=0),\"\",IF(AND('Cálc. Sist. Extinção Automática'!$A$5>=1,'Cálc. Sist. Extinção Automática'!$A$5<=7),MAX($AD64:$AF64),IF(AND('Cálc. Sist. Extinção Automática'!$A$5>=11,'Cálc. Sist. Extinção Automática'!$A$5<=18),MAX($AA64:$AC64),IF('Cálc. Sist. Extinção Automática'!$A$5=8,$AA64,IF('Cálc. Sist. Extinção Automática'!$A$5=9,$AB64,IF('Cálc. Sist. Extinção Automática'!$A$5=10,$AC64,\"\")))))))","v":""},0,27.3,27.3,36,{"$f":"IF(OR('Cálc. Sist. Extinção Automática'!$A$5<>1,$B64=\"\"),\"\",IF($Z64<=2,27.3,IF($Z64<=3,36,IF($Z64<=5,41.9,IF($Z64<=10,53.1,IF($Z64<=30,68.9,IF($Z64<=60,80.9,IF($Z64<=100,105.3,129.7))))))))","v":""},{"$f":"IF(OR(AND('Cálc. Sist. Extinção Automática'!$A$5<>2,'Cálc. Sist. Extinção Automática'!$A$5<>3,'Cálc. Sist. Extinção Automática'!$A$5<>4),$B64=\"\"),\"\",IF($Z64<=2,27.3,IF($Z64<=3,36,IF($Z64<=5,41.9,IF($Z64<=10,53.1,IF($Z64<=20,68.9,IF($Z64<=40,80.9,IF($Z64<=100,105.3,129.7))))))))","v":""},{"$f":"IF(OR(AND('Cálc. Sist. Extinção Automática'!$A$5<>5,'Cálc. Sist. Extinção Automática'!$A$5<>6),$B64=\"\"),\"\",IF($Z64<=1,27.3,IF($Z64<=2,36,IF($Z64<=5,41.9,IF($Z64<=8,53.1,IF($Z64<=15,68.9,IF($Z64<=27,80.9,IF($Z64<=55,105.3,129.7))))))))","v":""},{"$f":"IF(OR(J64=\"\",L64=\"\"),\"\",(66.7*J64/'Cálc. Sist. Extinção Automática'!$B$17)/(PI()*W64^2))","v":""},null,null,null,{"$f":"IF(I64=\"\",\"\",'Curvas da Instalação'!$D$22)","v":""},null,null,{"$f":"IF(AK64=\"\",\"\",(66.7*AK64/'Cálc. Sist. Extinção Automática'!$B$17)/(PI()*L64^2))","v":""},null,{"$f":"IF(AK64=\"\",\"\",IF('Cálc. Sist. Extinção Automática'!$M$15=\"\",'Cálc. Sist. Extinção Automática'!$B$18*'Cálc. Sist. Extinção Automática'!$AU$19*I64*61.7*100000*((AK64/'Cálc. Sist. Extinção Automática'!$B$17)^1.85/('Cálc. Sist. Extinção Automática'!$P$16^1.85*L64^4.87)),'Cálc. Sist. Extinção Automática'!$B$18*'Cálc. Sist. Extinção Automática'!$AU$19*I64*((4*'Cálc. Sist. Extinção Automática'!$P$16*((AN64^7)/(L64/1000))^(1/4))/(L64/1000))))","v":""},"",""]
[null,"",null,null,null,null,null,null,{"$f":"IF(OR($C$58=\"\",F65=\"\"),\"\",IF(H65=\"\",F65*(1+'Cálc. Sist. Extinção Automática'!$P$14),F65+H65))","v":""},{"$f":"IF(OR($C$58=\"\",F65=\"\"),\"\",MAX('Cálc. Sist. Extinção Automática'!$R$25:$R$49))","v":""},null,"",{"$f":"IF(OR('Cálc. Sist. Extinção Automática'!$P$16=\"\",J65=\"\",L65=\"\",$C$58=\"\"),\"\",IF('Cálc. Sist. Extinção Automática'!$M$15=\"\",'Cálc. Sist. Extinção Automática'!$B$18*'Cálc. Sist. Extinção Automática'!$AU$19*I65*61.7*100000*((J65/'Cálc. Sist. Extinção Automática'!$B$17)^1.85/('Cálc. Sist. Extinção Automática'!$P$16^1.85*L65^4.87)),'Cálc. Sist. Extinção Automática'!$B$18*'Cálc. Sist. Extinção Automática'!$AU$19*I65*((4*'Cálc. Sist. Extinção Automática'!$P$16*((AG65^7)/(L65/1000))^(1/4))/(L65/1000))))","v":""},{"$f":"IF(OR($C$58=\"\",G65=\"\",G65=0),\"\",G65*'Cálc. Sist. Extinção Automática'!$AU$19*'Cálc. Sist. Extinção Automática'!$B$18)","v":""},"",null,null,null,null,null,null,null,"",{"$f":"IF(K65=\"\",\"\",IF($K65<='Quadro 1'!$G$10,'Quadro 1'!$G$10,IF($K65<='Quadro 1'!$G$11,'Quadro 1'!$G$11,IF($K65<='Quadro 1'!$G$12,'Quadro 1'!$G$12,IF($K65<='Quadro 1'!$G$13,'Quadro 1'!$G$13,IF($K65<='Quadro 1'!$G$14,'Quadro 1'!$G$14,IF($K65<='Quadro 1'!$G$15,'Quadro 1'!$G$15,IF($K65<='Quadro 1'!$G$16,'Quadro 1'!$G$16,IF($K65<='Quadro 1'!$G$17,'Quadro 1'!$G$17,IF($K65<='Quadro 1'!$G$18,'Quadro 1'!$G$18,IF($K65<='Quadro 1'!$G$19,'Quadro 1'!$G$19,IF($K65<='Quadro 1'!$G$20,'Quadro 1'!$G$20,IF($K65<='Quadro 1'!$G$21,'Quadro 1'!$G$21,IF($K65<='Quadro 1'!$G$22,'Quadro 1'!$G$22,IF($K65<='Quadro 1'!$G$23,'Quadro 1'!$G$23,'Quadro 1'!$G$23)))))))))))))))","v":""},{"$f":"IF(C65=\"\",\"\",IF(AND('Cálc. Sist. Extinção Automática'!$A$5>=1,'Cálc. Sist. Extinção Automática'!$A$5<=7,MAX($AD65:$AF65)=0),\"\",IF(AND('Cálc. Sist. Extinção Automática'!$A$5>=1,'Cálc. Sist. Extinção Automática'!$A$5<=7),MAX($AD65:$AF65),IF(AND('Cálc. Sist. Extinção Automática'!$A$5>=11,'Cálc. Sist. Extinção Automática'!$A$5<=18),MAX($AA65:$AC65),IF('Cálc. Sist. Extinção Automática'!$A$5=8,$AA65,IF('Cálc. Sist. Extinção Automática'!$A$5=9,$AB65,IF('Cálc. Sist. Extinção Automática'!$A$5=10,$AC65,\"\")))))))","v":""},0,27.3,27.3,36,{"$f":"IF(OR('Cálc. Sist. Extinção Automática'!$A$5<>1,$B65=\"\"),\"\",IF($Z65<=2,27.3,IF($Z65<=3,36,IF($Z65<=5,41.9,IF($Z65<=10,53.1,IF($Z65<=30,68.9,IF($Z65<=60,80.9,IF($Z65<=100,105.3,129.7))))))))","v":""},{"$f":"IF(OR(AND('Cálc. Sist. Extinção Automática'!$A$5<>2,'Cálc. Sist. Extinção Automática'!$A$5<>3,'Cálc. Sist. Extinção Automática'!$A$5<>4),$B65=\"\"),\"\",IF($Z65<=2,27.3,IF($Z65<=3,36,IF($Z65<=5,41.9,IF($Z65<=10,53.1,IF($Z65<=20,68.9,IF($Z65<=40,80.9,IF($Z65<=100,105.3,129.7))))))))","v":""},{"$f":"IF(OR(AND('Cálc. Sist. Extinção Automática'!$A$5<>5,'Cálc. Sist. Extinção Automática'!$A$5<>6),$B65=\"\"),\"\",IF($Z65<=1,27.3,IF($Z65<=2,36,IF($Z65<=5,41.9,IF($Z65<=8,53.1,IF($Z65<=15,68.9,IF($Z65<=27,80.9,IF($Z65<=55,105.3,129.7))))))))","v":""},{"$f":"IF(OR(J65=\"\",L65=\"\"),\"\",(66.7*J65/'Cálc. Sist. Extinção Automática'!$B$17)/(PI()*W65^2))","v":""},null,null,null,{"$f":"IF(I65=\"\",\"\",'Curvas da Instalação'!$D$22)","v":""},null,null,{"$f":"IF(AK65=\"\",\"\",(66.7*AK65/'Cálc. Sist. Extinção Automática'!$B$17)/(PI()*L65^2))","v":""},null,{"$f":"IF(AK65=\"\",\"\",IF('Cálc. Sist. Extinção Automática'!$M$15=\"\",'Cálc. Sist. Extinção Automática'!$B$18*'Cálc. Sist. Extinção Automática'!$AU$19*I65*61.7*100000*((AK65/'Cálc. Sist. Extinção Automática'!$B$17)^1.85/('Cálc. Sist. Extinção Automática'!$P$16^1.85*L65^4.87)),'Cálc. Sist. Extinção Automática'!$B$18*'Cálc. Sist. Extinção Automática'!$AU$19*I65*((4*'Cálc. Sist. Extinção Automática'!$P$16*((AN65^7)/(L65/1000))^(1/4))/(L65/1000))))","v":""},"",""]
[null,"",null,null,null,null,null,null,{"$f":"IF(OR($C$58=\"\",F66=\"\"),\"\",IF(H66=\"\",F66*(1+'Cálc. Sist. Extinção Automática'!$P$14),F66+H66))","v":""},{"$f":"IF(OR($C$58=\"\",F66=\"\"),\"\",MAX('Cálc. Sist. Extinção Automática'!$R$25:$R$49))","v":""},null,"",{"$f":"IF(OR('Cálc. Sist. Extinção Automática'!$P$16=\"\",J66=\"\",L66=\"\",$C$58=\"\"),\"\",IF('Cálc. Sist. Extinção Automática'!$M$15=\"\",'Cálc. Sist. Extinção Automática'!$B$18*'Cálc. Sist. Extinção Automática'!$AU$19*I66*61.7*100000*((J66/'Cálc. Sist. Extinção Automática'!$B$17)^1.85/('Cálc. Sist. Extinção Automática'!$P$16^1.85*L66^4.87)),'Cálc. Sist. Extinção Automática'!$B$18*'Cálc. Sist. Extinção Automática'!$AU$19*I66*((4*'Cálc. Sist. Extinção Automática'!$P$16*((AG66^7)/(L66/1000))^(1/4))/(L66/1000))))","v":""},{"$f":"IF(OR($C$58=\"\",G66=\"\",G66=0),\"\",G66*'Cálc. Sist. Extinção Automática'!$AU$19*'Cálc. Sist. Extinção Automática'!$B$18)","v":""},"",null,null,null,null,null,null,null,"",{"$f":"IF(K66=\"\",\"\",IF($K66<='Quadro 1'!$G$10,'Quadro 1'!$G$10,IF($K66<='Quadro 1'!$G$11,'Quadro 1'!$G$11,IF($K66<='Quadro 1'!$G$12,'Quadro 1'!$G$12,IF($K66<='Quadro 1'!$G$13,'Quadro 1'!$G$13,IF($K66<='Quadro 1'!$G$14,'Quadro 1'!$G$14,IF($K66<='Quadro 1'!$G$15,'Quadro 1'!$G$15,IF($K66<='Quadro 1'!$G$16,'Quadro 1'!$G$16,IF($K66<='Quadro 1'!$G$17,'Quadro 1'!$G$17,IF($K66<='Quadro 1'!$G$18,'Quadro 1'!$G$18,IF($K66<='Quadro 1'!$G$19,'Quadro 1'!$G$19,IF($K66<='Quadro 1'!$G$20,'Quadro 1'!$G$20,IF($K66<='Quadro 1'!$G$21,'Quadro 1'!$G$21,IF($K66<='Quadro 1'!$G$22,'Quadro 1'!$G$22,IF($K66<='Quadro 1'!$G$23,'Quadro 1'!$G$23,'Quadro 1'!$G$23)))))))))))))))","v":""},{"$f":"IF(C66=\"\",\"\",IF(AND('Cálc. Sist. Extinção Automática'!$A$5>=1,'Cálc. Sist. Extinção Automática'!$A$5<=7,MAX($AD66:$AF66)=0),\"\",IF(AND('Cálc. Sist. Extinção Automática'!$A$5>=1,'Cálc. Sist. Extinção Automática'!$A$5<=7),MAX($AD66:$AF66),IF(AND('Cálc. Sist. Extinção Automática'!$A$5>=11,'Cálc. Sist. Extinção Automática'!$A$5<=18),MAX($AA66:$AC66),IF('Cálc. Sist. Extinção Automática'!$A$5=8,$AA66,IF('Cálc. Sist. Extinção Automática'!$A$5=9,$AB66,IF('Cálc. Sist. Extinção Automática'!$A$5=10,$AC66,\"\")))))))","v":""},0,27.3,27.3,36,{"$f":"IF(OR('Cálc. Sist. Extinção Automática'!$A$5<>1,$B66=\"\"),\"\",IF($Z66<=2,27.3,IF($Z66<=3,36,IF($Z66<=5,41.9,IF($Z66<=10,53.1,IF($Z66<=30,68.9,IF($Z66<=60,80.9,IF($Z66<=100,105.3,129.7))))))))","v":""},{"$f":"IF(OR(AND('Cálc. Sist. Extinção Automática'!$A$5<>2,'Cálc. Sist. Extinção Automática'!$A$5<>3,'Cálc. Sist. Extinção Automática'!$A$5<>4),$B66=\"\"),\"\",IF($Z66<=2,27.3,IF($Z66<=3,36,IF($Z66<=5,41.9,IF($Z66<=10,53.1,IF($Z66<=20,68.9,IF($Z66<=40,80.9,IF($Z66<=100,105.3,129.7))))))))","v":""},{"$f":"IF(OR(AND('Cálc. Sist. Extinção Automática'!$A$5<>5,'Cálc. Sist. Extinção Automática'!$A$5<>6),$B66=\"\"),\"\",IF($Z66<=1,27.3,IF($Z66<=2,36,IF($Z66<=5,41.9,IF($Z66<=8,53.1,IF($Z66<=15,68.9,IF($Z66<=27,80.9,IF($Z66<=55,105.3,129.7))))))))","v":""},{"$f":"IF(OR(J66=\"\",L66=\"\"),\"\",(66.7*J66/'Cálc. Sist. Extinção Automática'!$B$17)/(PI()*W66^2))","v":""},null,null,null,{"$f":"IF(I66=\"\",\"\",'Curvas da Instalação'!$D$22)","v":""},null,null,{"$f":"IF(AK66=\"\",\"\",(66.7*AK66/'Cálc. Sist. Extinção Automática'!$B$17)/(PI()*L66^2))","v":""},null,{"$f":"IF(AK66=\"\",\"\",IF('Cálc. Sist. Extinção Automática'!$M$15=\"\",'Cálc. Sist. Extinção Automática'!$B$18*'Cálc. Sist. Extinção Automática'!$AU$19*I66*61.7*100000*((AK66/'Cálc. Sist. Extinção Automática'!$B$17)^1.85/('Cálc. Sist. Extinção Automática'!$P$16^1.85*L66^4.87)),'Cálc. Sist. Extinção Automática'!$B$18*'Cálc. Sist. Extinção Automática'!$AU$19*I66*((4*'Cálc. Sist. Extinção Automática'!$P$16*((AN66^7)/(L66/1000))^(1/4))/(L66/1000))))","v":""},"",""]
[null,"",null,null,null,null,null,null,{"$f":"IF(OR($C$58=\"\",F67=\"\"),\"\",IF(H67=\"\",F67*(1+'Cálc. Sist. Extinção Automática'!$P$14),F67+H67))","v":""},{"$f":"IF(OR($C$58=\"\",F67=\"\"),\"\",MAX('Cálc. Sist. Extinção Automática'!$R$25:$R$49))","v":""},null,"",{"$f":"IF(OR('Cálc. Sist. Extinção Automática'!$P$16=\"\",J67=\"\",L67=\"\",$C$58=\"\"),\"\",IF('Cálc. Sist. Extinção Automática'!$M$15=\"\",'Cálc. Sist. Extinção Automática'!$B$18*'Cálc. Sist. Extinção Automática'!$AU$19*I67*61.7*100000*((J67/'Cálc. Sist. Extinção Automática'!$B$17)^1.85/('Cálc. Sist. Extinção Automática'!$P$16^1.85*L67^4.87)),'Cálc. Sist. Extinção Automática'!$B$18*'Cálc. Sist. Extinção Automática'!$AU$19*I67*((4*'Cálc. Sist. Extinção Automática'!$P$16*((AG67^7)/(L67/1000))^(1/4))/(L67/1000))))","v":""},{"$f":"IF(OR($C$58=\"\",G67=\"\",G67=0),\"\",G67*'Cálc. Sist. Extinção Automática'!$AU$19*'Cálc. Sist. Extinção Automática'!$B$18)","v":""},"",null,null,null,null,null,null,null,"",{"$f":"IF(K67=\"\",\"\",IF($K67<='Quadro 1'!$G$10,'Quadro 1'!$G$10,IF($K67<='Quadro 1'!$G$11,'Quadro 1'!$G$11,IF($K67<='Quadro 1'!$G$12,'Quadro 1'!$G$12,IF($K67<='Quadro 1'!$G$13,'Quadro 1'!$G$13,IF($K67<='Quadro 1'!$G$14,'Quadro 1'!$G$14,IF($K67<='Quadro 1'!$G$15,'Quadro 1'!$G$15,IF($K67<='Quadro 1'!$G$16,'Quadro 1'!$G$16,IF($K67<='Quadro 1'!$G$17,'Quadro 1'!$G$17,IF($K67<='Quadro 1'!$G$18,'Quadro 1'!$G$18,IF($K67<='Quadro 1'!$G$19,'Quadro 1'!$G$19,IF($K67<='Quadro 1'!$G$20,'Quadro 1'!$G$20,IF($K67<='Quadro 1'!$G$21,'Quadro 1'!$G$21,IF($K67<='Quadro 1'!$G$22,'Quadro 1'!$G$22,IF($K67<='Quadro 1'!$G$23,'Quadro 1'!$G$23,'Quadro 1'!$G$23)))))))))))))))","v":""},{"$f":"IF(C67=\"\",\"\",IF(AND('Cálc. Sist. Extinção Automática'!$A$5>=1,'Cálc. Sist. Extinção Automática'!$A$5<=7,MAX($AD67:$AF67)=0),\"\",IF(AND('Cálc. Sist. Extinção Automática'!$A$5>=1,'Cálc. Sist. Extinção Automática'!$A$5<=7),MAX($AD67:$AF67),IF(AND('Cálc. Sist. Extinção Automática'!$A$5>=11,'Cálc. Sist. Extinção Automática'!$A$5<=18),MAX($AA67:$AC67),IF('Cálc. Sist. Extinção Automática'!$A$5=8,$AA67,IF('Cálc. Sist. Extinção Automática'!$A$5=9,$AB67,IF('Cálc. Sist. Extinção Automática'!$A$5=10,$AC67,\"\")))))))","v":""},0,27.3,27.3,36,{"$f":"IF(OR('Cálc. Sist. Extinção Automática'!$A$5<>1,$B67=\"\"),\"\",IF($Z67<=2,27.3,IF($Z67<=3,36,IF($Z67<=5,41.9,IF($Z67<=10,53.1,IF($Z67<=30,68.9,IF($Z67<=60,80.9,IF($Z67<=100,105.3,129.7))))))))","v":""},{"$f":"IF(OR(AND('Cálc. Sist. Extinção Automática'!$A$5<>2,'Cálc. Sist. Extinção Automática'!$A$5<>3,'Cálc. Sist. Extinção Automática'!$A$5<>4),$B67=\"\"),\"\",IF($Z67<=2,27.3,IF($Z67<=3,36,IF($Z67<=5,41.9,IF($Z67<=10,53.1,IF($Z67<=20,68.9,IF($Z67<=40,80.9,IF($Z67<=100,105.3,129.7))))))))","v":""},{"$f":"IF(OR(AND('Cálc. Sist. Extinção Automática'!$A$5<>5,'Cálc. Sist. Extinção Automática'!$A$5<>6),$B67=\"\"),\"\",IF($Z67<=1,27.3,IF($Z67<=2,36,IF($Z67<=5,41.9,IF($Z67<=8,53.1,IF($Z67<=15,68.9,IF($Z67<=27,80.9,IF($Z67<=55,105.3,129.7))))))))","v":""},{"$f":"IF(OR(J67=\"\",L67=\"\"),\"\",(66.7*J67/'Cálc. Sist. Extinção Automática'!$B$17)/(PI()*W67^2))","v":""},null,null,null,{"$f":"IF(I67=\"\",\"\",'Curvas da Instalação'!$D$22)","v":""},null,null,{"$f":"IF(AK67=\"\",\"\",(66.7*AK67/'Cálc. Sist. Extinção Automática'!$B$17)/(PI()*L67^2))","v":""},null,{"$f":"IF(AK67=\"\",\"\",IF('Cálc. Sist. Extinção Automática'!$M$15=\"\",'Cálc. Sist. Extinção Automática'!$B$18*'Cálc. Sist. Extinção Automática'!$AU$19*I67*61.7*100000*((AK67/'Cálc. Sist. Extinção Automática'!$B$17)^1.85/('Cálc. Sist. Extinção Automática'!$P$16^1.85*L67^4.87)),'Cálc. Sist. Extinção Automática'!$B$18*'Cálc. Sist. Extinção Automática'!$AU$19*I67*((4*'Cálc. Sist. Extinção Automática'!$P$16*((AN67^7)/(L67/1000))^(1/4))/(L67/1000))))","v":""},"",""]
[null,null,null,null,null,null,null,null,null,null,null,null,"Totais:",{"$f":"SUM(N58:N67)","v":0},{"$f":"SUM(O58:O67)","v":0},null,null,null,null,null,null,null,null,null,null,null,null,null,null,null,null,null,null,null,null,null,null,null,null,null,null,"Totais:",{"$f":"SUM(AQ58:AQ67)","v":0},{"$f":"SUM(AR58:AR67)","v":0}]
[null,null,null,null,null,null,null,null,null,null,null,null,null,null,null,null,null,null,null,null,null,null,"Curva menos crítica (com total de Sprinklers em simultâneo)",null,null,null,null,null,null,null,null,null,null,null,null,null,"Curva menos crítica (com apenas 1 Sprinkler em simultâneo)"]
[null,null,null,null,null,null,null,null,null,null,null,null,null,null,null,null,null,null,null,null,null,null,null,"Troço","Troço","Posição","Início","Fim","simultâneo",null,null,"Troços","ΔPc","ΔP","ΔPest.",null,"Qtroço","Leq.","Di","V ","ΔPc","ΔP"]
[null,null,null,null,null,null,null,null,null,null,null,null,null,null,null,null,null,null,null,null,null,null,null,"crítico","sprinkler","do nó",null,null,"NSsim.troço",null,null,"relevantes",{"$f":"'Cálc. Sist. Extinção Automática'!AH24","v":"kPa"},{"$f":"AG71","v":"kPa"},{"$f":"'Cálc. Sist. Extinção Automática'!AJ24","v":"kPa"},null,{"$f":"J57","v":"l/min"},"m","mm","m/s",{"$f":"AG71","v":"kPa"},{"$f":"AG71","v":"kPa"}]
[null,null,null,null,null,null,null,null,null,null,null,null,null,null,null,null,null,null,null,null,null,null,{"$f":"IF(AA72=\"\",\"\",COUNTIF(AA72:AA97,AA72))","v":1},null,null,null,{"$f":"C24","v":0},null,"nº",{"$f":"MIN(AD73:AD97)","v":0},null,null,{"$f":"SUM(AG73:AG97)","v":0},null,{"$f":"SUM(AI73:AI97)","v":0},null,null,null,null,null,{"$f":"SUM(AO73:AO97)","v":0}]
[null,null,null,null,null,null,null,null,null,null,null,null,null,null,null,null,null,null,null,null,null,null,1,{"$f":"'Cálc. Sist. Extinção Automática'!B25","v":""},{"$f":"'Cálc. Sist. Extinção Automática'!D25","v":""},{"$f":"IF($AA$72=AB73,W73,\"\")","v":""},{"$f":"IF('Cálc. Sist. Extinção Automática'!F25<>\"\",'Cálc. Sist. Extinção Automática'!F25,\"\")","v":""},{"$f":"IF('Cálc. Sist. Extinção Automática'!G25<>\"\",'Cálc. Sist. Extinção Automática'!G25,\"\")","v":""},{"$f":"IF('Cálc. Sist. Extinção Automática'!H25<>\"\",'Cálc. Sist. Extinção Automática'!H25,\"\")","v":""},{"$f":"IF(Z73=\"\",\"\",IF(25-COUNTBLANK('Cálc. Sist. Extinção Automática'!DT25:'Cálc. Sist. Extinção Automática'!ER25)=0,\"\",25-COUNTBLANK('Cálc. Sist. Extinção Automática'!DT25:'Cálc. Sist. Extinção Automática'!ER25)))","v":""},{"$f":"IF(25-COUNTBLANK('Cálc. Sist. Extinção Automática'!DT25:'Cálc. Sist. Extinção Automática'!ER25)=0,\"\",25-COUNTBLANK('Cálc. Sist. Extinção Automática'!DT25:'Cálc. Sist. Extinção Automática'!ER25))","v":""},{"$f":"IF(AE73<=$AD$72,1,\"\")","v":""},{"$f":"IF(OR(AND(X73=\"c\",Y73=\"s\"),AND(X73=\"c\",AF73=1),AND(X73=\"c\",AC73<'Cálc. Sist. Extinção Automática'!$AU$6)),'Cálc. Sist. Extinção Automática'!AH25,\"\")","v":""},{"$f":"IF(AG73=\"\",\"\",'Cálc. Sist. Extinção Automática'!AF25)","v":""},{"$f":"IF(AND(AG73=\"\",AH73=\"\"),\"\",IF(AH73=\"\",\"\",(AG73-AH73)))","v":""},null,{"$f":"IF(OR($C$58,AG73=\"\"),\"\",'Curvas da Instalação'!$D$22)","v":""},{"$f":"IF(AK73=\"\",\"\",'Cálc. Sist. Extinção Automática'!M25)","v":""},{"$f":"IF(AK73=\"\",\"\",'Cálc. Sist. Extinção Automática'!W25)","v":""},{"$f":"IF(AK73=\"\",\"\",(66.7*AK73/'Cálc. Sist. Extinção Automática'!$B$17)/(PI()*AM73^2))","v":""},{"$f":"IF(AK73=\"\",\"\",AP73+AI73)","v":""},{"$f":"IF(AK73=\"\",\"\",IF('Cálc. Sist. Extinção Automática'!$M$15=\"\",'Cálc. Sist. Extinção Automática'!$B$18*'Cálc. Sist. Extinção Automática'!$AU$19*AL73*61.7*100000*((AK73/'Cálc. Sist. Extinção Automática'!$B$17)^1.85/('Cálc. Sist. Extinção Automática'!$P$16^1.85*AM73^4.87)),'Cálc. Sist. Extinção Automática'!$B$18*'Cálc. Sist. Extinção Automática'!$AU$19*AL73*((4*'Cálc. Sist. Extinção Automática'!$P$16*((AN73^7)/(AM73/1000))^(1/4))/(AM73/1000))))","v":""}]
[null,null,null,null,null,null,null,null,null,null,null,null,null,null,null,null,null,null,null,null,null,null,2,{"$f":"'Cálc. Sist. Extinção Automática'!B26","v":""},{"$f":"'Cálc. Sist. Extinção Automática'!D26","v":""},"",{"$f":"IF('Cálc. Sist. Extinção Automática'!F26<>\"\",'Cálc. Sist. Extinção Automática'!F26,\"\")","v":""},{"$f":"IF('Cálc. Sist. Extinção Automática'!G26<>\"\",'Cálc. Sist. Extinção Automática'!G26,\"\")","v":""},{"$f":"IF('Cálc. Sist. Extinção Automática'!H26<>\"\",'Cálc. Sist. Extinção Automática'!H26,\"\")","v":""},{"$f":"IF(Z74=\"\",\"\",IF(25-COUNTBLANK('Cálc. Sist. Extinção Automática'!DT26:'Cálc. Sist. Extinção Automática'!ER26)=0,\"\",25-COUNTBLANK('Cálc. Sist. Extinção Automática'!DT26:'Cálc. Sist. Extinção Automática'!ER26)))","v":""},{"$f":"IF(25-COUNTBLANK('Cálc. Sist. Extinção Automática'!DT26:'Cálc. Sist. Extinção Automática'!ER26)=0,\"\",25-COUNTBLANK('Cálc. Sist. Extinção Automática'!DT26:'Cálc. Sist. Extinção Automática'!ER26))","v":""},"",{"$f":"IF(OR(AND(X74=\"c\",Y74=\"s\"),AND(X74=\"c\",AF74=1),AND(X74=\"c\",AC74<'Cálc. Sist. Extinção Automática'!$AU$6)),'Cálc. Sist. Extinção Automática'!AH26,\"\")","v":""},{"$f":"IF(AG74=\"\",\"\",'Cálc. Sist. Extinção Automática'!AF26)","v":""},{"$f":"IF(AND(AG74=\"\",AH74=\"\"),\"\",IF(AH74=\"\",\"\",(AG74-AH74)))","v":""},null,{"$f":"IF(OR($C$58,AG74=\"\"),\"\",'Curvas da Instalação'!$D$22)","v":""},{"$f":"IF(AK74=\"\",\"\",'Cálc. Sist. Extinção Automática'!M26)","v":""},{"$f":"IF(AK74=\"\",\"\",'Cálc. Sist. Extinção Automática'!W26)","v":""},{"$f":"IF(AK74=\"\",\"\",(66.7*AK74/'Cálc. Sist. Extinção Automática'!$B$17)/(PI()*AM74^2))","v":""},{"$f":"IF(AK74=\"\",\"\",AP74+AI74)","v":""},{"$f":"IF(AK74=\"\",\"\",IF('Cálc. Sist. Extinção Automática'!$M$15=\"\",'Cálc. Sist. Extinção Automática'!$B$18*'Cálc. Sist. Extinção Automática'!$AU$19*AL74*61.7*100000*((AK74/'Cálc. Sist. Extinção Automática'!$B$17)^1.85/('Cálc. Sist. Extinção Automática'!$P$16^1.85*AM74^4.87)),'Cálc. Sist. Extinção Automática'!$B$18*'Cálc. Sist. Extinção Automática'!$AU$19*AL74*((4*'Cálc. Sist. Extinção Automática'!$P$16*((AN74^7)/(AM74/1000))^(1/4))/(AM74/1000))))","v":""}]
[null,null,null,null,null,null,null,null,null,null,null,null,null,null,null,null,null,null,null,null,null,null,3,{"$f":"'Cálc. Sist. Extinção Automática'!B27","v":""},{"$f":"'Cálc. Sist. Extinção Automática'!D27","v":""},"",{"$f":"IF('Cálc. Sist. Extinção Automática'!F27<>\"\",'Cálc. Sist. Extinção Automática'!F27,\"\")","v":""},{"$f":"IF('Cálc. Sist. Extinção Automática'!G27<>\"\",'Cálc. Sist. Extinção Automática'!G27,\"\")","v":""},{"$f":"IF('Cálc. Sist. Extinção Automática'!H27<>\"\",'Cálc. Sist. Extinção Automática'!H27,\"\")","v":""},{"$f":"IF(Z75=\"\",\"\",IF(25-COUNTBLANK('Cálc. Sist. Extinção Automática'!DT27:'Cálc. Sist. Extinção Automática'!ER27)=0,\"\",25-COUNTBLANK('Cálc. Sist. Extinção Automática'!DT27:'Cálc. Sist. Extinção Automática'!ER27)))","v":""},{"$f":"IF(25-COUNTBLANK('Cálc. Sist. Extinção Automática'!DT27:'Cálc. Sist. Extinção Automática'!ER27)=0,\"\",25-COUNTBLANK('Cálc. Sist. Extinção Automática'!DT27:'Cálc. Sist. Extinção Automática'!ER27))","v":""},"",{"$f":"IF(OR(AND(X75=\"c\",Y75=\"s\"),AND(X75=\"c\",AF75=1),AND(X75=\"c\",AC75<'Cálc. Sist. Extinção Automática'!$AU$6)),'Cálc. Sist. Extinção Automática'!AH27,\"\")","v":""},{"$f":"IF(AG75=\"\",\"\",'Cálc. Sist. Extinção Automática'!AF27)","v":""},"",null,{"$f":"IF(OR($C$58,AG75=\"\"),\"\",'Curvas da Instalação'!$D$22)","v":""},{"$f":"IF(AK75=\"\",\"\",'Cálc. Sist. Extinção Automática'!M27)","v":""},{"$f":"IF(AK75=\"\",\"\",'Cálc. Sist. Extinção Automática'!W27)","v":""},{"$f":"IF(AK75=\"\",\"\",(66.7*AK75/'Cálc. Sist. Extinção Automática'!$B$17)/(PI()*AM75^2))","v":""},"",{"$f":"IF(AK75=\"\",\"\",IF('Cálc. Sist. Extinção Automática'!$M$15=\"\",'Cálc. Sist. Extinção Automática'!$B$18*'Cálc. Sist. Extinção Automática'!$AU$19*AL75*61.7*100000*((AK75/'Cálc. Sist. Extinção Automática'!$B$17)^1.85/('Cálc. Sist. Extinção Automática'!$P$16^1.85*AM75^4.87)),'Cálc. Sist. Extinção Automática'!$B$18*'Cálc. Sist. Extinção Automática'!$AU$19*AL75*((4*'Cálc. Sist. Extinção Automática'!$P$16*((AN75^7)/(AM75/1000))^(1/4))/(AM75/1000))))","v":""}]
[null,null,null,null,null,null,null,null,null,null,null,null,null,null,null,null,null,null,null,null,null,null,4,{"$f":"'Cálc. Sist. Extinção Automática'!B28","v":""},{"$f":"'Cálc. Sist. Extinção Automática'!D28","v":""},"",{"$f":"IF('Cálc. Sist. Extinção Automática'!F28<>\"\",'Cálc. Sist. Extinção Automática'!F28,\"\")","v":""},{"$f":"IF('Cálc. Sist. Extinção Automática'!G28<>\"\",'Cálc. Sist. Extinção Automática'!G28,\"\")","v":""},{"$f":"IF('Cálc. Sist. Extinção Automática'!H28<>\"\",'Cálc. Sist. Extinção Automática'!H28,\"\")","v":""},{"$f":"IF(Z76=\"\",\"\",IF(25-COUNTBLANK('Cálc. Sist. Extinção Automática'!DT28:'Cálc. Sist. Extinção Automática'!ER28)=0,\"\",25-COUNTBLANK('Cálc. Sist. Extinção Automática'!DT28:'Cálc. Sist. Extinção Automática'!ER28)))","v":""},{"$f":"IF(25-COUNTBLANK('Cálc. Sist. Extinção Automática'!DT28:'Cálc. Sist. Extinção Automática'!ER28)=0,\"\",25-COUNTBLANK('Cálc. Sist. Extinção Automática'!DT28:'Cálc. Sist. Extinção Automática'!ER28))","v":""},"",{"$f":"IF(OR(AND(X76=\"c\",Y76=\"s\"),AND(X76=\"c\",AF76=1),AND(X76=\"c\",AC76<'Cálc. Sist. Extinção Automática'!$AU$6)),'Cálc. Sist. Extinção Automática'!AH28,\"\")","v":""},{"$f":"IF(AG76=\"\",\"\",'Cálc. Sist. Extinção Automática'!AF28)","v":""},"",null,{"$f":"IF(OR($C$58,AG76=\"\"),\"\",'Curvas da Instalação'!$D$22)","v":""},{"$f":"IF(AK76=\"\",\"\",'Cálc. Sist. Extinção Automática'!M28)","v":""},{"$f":"IF(AK76=\"\",\"\",'Cálc. Sist. Extinção Automática'!W28)","v":""},{"$f":"IF(AK76=\"\",\"\",(66.7*AK76/'Cálc. Sist. Extinção Automática'!$B$17)/(PI()*AM76^2))","v":""},"",{"$f":"IF(AK76=\"\",\"\",IF('Cálc. Sist. Extinção Automática'!$M$15=\"\",'Cálc. Sist. Extinção Automática'!$B$18*'Cálc. Sist. Extinção Automática'!$AU$19*AL76*61.7*100000*((AK76/'Cálc. Sist. Extinção Automática'!$B$17)^1.85/('Cálc. Sist. Extinção Automática'!$P$16^1.85*AM76^4.87)),'Cálc. Sist. Extinção Automática'!$B$18*'Cálc. Sist. Extinção Automática'!$AU$19*AL76*((4*'Cálc. Sist. Extinção Automática'!$P$16*((AN76^7)/(AM76/1000))^(1/4))/(AM76/1000))))","v":""}]
[null,null,null,null,null,null,null,null,null,null,null,null,null,null,null,null,null,null,null,null,null,null,5,{"$f":"'Cálc. Sist. Extinção Automática'!B29","v":""},{"$f":"'Cálc. Sist. Extinção Automática'!D29","v":""},"",{"$f":"IF('Cálc. Sist. Extinção Automática'!F29<>\"\",'Cálc. Sist. Extinção Automática'!F29,\"\")","v":""},{"$f":"IF('Cálc. Sist. Extinção Automática'!G29<>\"\",'Cálc. Sist. Extinção Automática'!G29,\"\")","v":""},{"$f":"IF('Cálc. Sist. Extinção Automática'!H29<>\"\",'Cálc. Sist. Extinção Automática'!H29,\"\")","v":""},{"$f":"IF(Z77=\"\",\"\",IF(25-COUNTBLANK('Cálc. Sist. Extinção Automática'!DT29:'Cálc. Sist. Extinção Automática'!ER29)=0,\"\",25-COUNTBLANK('Cálc. Sist. Extinção Automática'!DT29:'Cálc. Sist. Extinção Automática'!ER29)))","v":""},{"$f":"IF(25-COUNTBLANK('Cálc. Sist. Extinção Automática'!DT29:'Cálc. Sist. Extinção Automática'!ER29)=0,\"\",25-COUNTBLANK('Cálc. Sist. Extinção Automática'!DT29:'Cálc. Sist. Extinção Automática'!ER29))","v":""},"",{"$f":"IF(OR(AND(X77=\"c\",Y77=\"s\"),AND(X77=\"c\",AF77=1),AND(X77=\"c\",AC77<'Cálc. Sist. Extinção Automática'!$AU$6)),'Cálc. Sist. Extinção Automática'!AH29,\"\")","v":""},{"$f":"IF(AG77=\"\",\"\",'Cálc. Sist. Extinção Automática'!AF29)","v":""},"",null,{"$f":"IF(OR($C$58,AG77=\"\"),\"\",'Curvas da Instalação'!$D$22)","v":""},{"$f":"IF(AK77=\"\",\"\",'Cálc. Sist. Extinção Automática'!M29)","v":""},{"$f":"IF(AK77=\"\",\"\",'Cálc. Sist. Extinção Automática'!W29)","v":""},{"$f":"IF(AK77=\"\",\"\",(66.7*AK77/'Cálc. Sist. Extinção Automática'!$B$17)/(PI()*AM77^2))","v":""},"",{"$f":"IF(AK77=\"\",\"\",IF('Cálc. Sist. Extinção Automática'!$M$15=\"\",'Cálc. Sist. Extinção Automática'!$B$18*'Cálc. Sist. Extinção Automática'!$AU$19*AL77*61.7*100000*((AK77/'Cálc. Sist. Extinção Automática'!$B$17)^1.85/('Cálc. Sist. Extinção Automática'!$P$16^1.85*AM77^4.87)),'Cálc. Sist. Extinção Automática'!$B$18*'Cálc. Sist. Extinção Automática'!$AU$19*AL77*((4*'Cálc. Sist. Extinção Automática'!$P$16*((AN77^7)/(AM77/1000))^(1/4))/(AM77/1000))))","v":""}]
[null,null,null,null,null,null,null,null,null,null,null,null,null,null,null,null,null,null,null,null,null,null,6,{"$f":"'Cálc. Sist. Extinção Automática'!B30","v":""},{"$f":"'Cálc. Sist. Extinção Automática'!D30","v":""},"",{"$f":"IF('Cálc. Sist. Extinção Automática'!F30<>\"\",'Cálc. Sist. Extinção Automática'!F30,\"\")","v":""},{"$f":"IF('Cálc. Sist. Extinção Automática'!G30<>\"\",'Cálc. Sist. Extinção Automática'!G30,\"\")","v":""},{"$f":"IF('Cálc. Sist. Extinção Automática'!H30<>\"\",'Cálc. Sist. Extinção Automática'!H30,\"\")","v":""},{"$f":"IF(Z78=\"\",\"\",IF(25-COUNTBLANK('Cálc. Sist. Extinção Automática'!DT30:'Cálc. Sist. Extinção Automática'!ER30)=0,\"\",25-COUNTBLANK('Cálc. Sist. Extinção Automática'!DT30:'Cálc. Sist. Extinção Automática'!ER30)))","v":""},{"$f":"IF(25-COUNTBLANK('Cálc. Sist. Extinção Automática'!DT30:'Cálc. Sist. Extinção Automática'!ER30)=0,\"\",25-COUNTBLANK('Cálc. Sist. Extinção Automática'!DT30:'Cálc. Sist. Extinção Automática'!ER30))","v":""},"",{"$f":"IF(OR(AND(X78=\"c\",Y78=\"s\"),AND(X78=\"c\",AF78=1),AND(X78=\"c\",AC78<'Cálc. Sist. Extinção Automática'!$AU$6)),'Cálc. Sist. Extinção Automática'!AH30,\"\")","v":""},{"$f":"IF(AG78=\"\",\"\",'Cálc. Sist. Extinção Automática'!AF30)","v":""},"",null,{"$f":"IF(OR($C$58,AG78=\"\"),\"\",'Curvas da Instalação'!$D$22)","v":""},{"$f":"IF(AK78=\"\",\"\",'Cálc. Sist. Extinção Automática'!M30)","v":""},{"$f":"IF(AK78=\"\",\"\",'Cálc. Sist. Extinção Automática'!W30)","v":""},{"$f":"IF(AK78=\"\",\"\",(66.7*AK78/'Cálc. Sist. Extinção Automática'!$B$17)/(PI()*AM78^2))","v":""},"",{"$f":"IF(AK78=\"\",\"\",IF('Cálc. Sist. Extinção Automática'!$M$15=\"\",'Cálc. Sist. Extinção Automática'!$B$18*'Cálc. Sist. Extinção Automática'!$AU$19*AL78*61.7*100000*((AK78/'Cálc. Sist. Extinção Automática'!$B$17)^1.85/('Cálc. Sist. Extinção Automática'!$P$16^1.85*AM78^4.87)),'Cálc. Sist. Extinção Automática'!$B$18*'Cálc. Sist. Extinção Automática'!$AU$19*AL78*((4*'Cálc. Sist. Extinção Automática'!$P$16*((AN78^7)/(AM78/1000))^(1/4))/(AM78/1000))))","v":""}]
[null,null,null,null,null,null,null,null,null,null,null,null,null,null,null,null,null,null,null,null,null,null,7,{"$f":"'Cálc. Sist. Extinção Automática'!B31","v":""},{"$f":"'Cálc. Sist. Extinção Automática'!D31","v":""},"",{"$f":"IF('Cálc. Sist. Extinção Automática'!F31<>\"\",'Cálc. Sist. Extinção Automática'!F31,\"\")","v":""},{"$f":"IF('Cálc. Sist. Extinção Automática'!G31<>\"\",'Cálc. Sist. Extinção Automática'!G31,\"\")","v":""},{"$f":"IF('Cálc. Sist. Extinção Automática'!H31<>\"\",'Cálc. Sist. Extinção Automática'!H31,\"\")","v":""},{"$f":"IF(Z79=\"\",\"\",IF(25-COUNTBLANK('Cálc. Sist. Extinção Automática'!DT31:'Cálc. Sist. Extinção Automática'!ER31)=0,\"\",25-COUNTBLANK('Cálc. Sist. Extinção Automática'!DT31:'Cálc. Sist. Extinção Automática'!ER31)))","v":""},{"$f":"IF(25-COUNTBLANK('Cálc. Sist. Extinção Automática'!DT31:'Cálc. Sist. Extinção Automática'!ER31)=0,\"\",25-COUNTBLANK('Cálc. Sist. Extinção Automática'!DT31:'Cálc. Sist. Extinção Automática'!ER31))","v":""},"",{"$f":"IF(OR(AND(X79=\"c\",Y79=\"s\"),AND(X79=\"c\",AF79=1),AND(X79=\"c\",AC79<'Cálc. Sist. Extinção Automática'!$AU$6)),'Cálc. Sist. Extinção Automática'!AH31,\"\")","v":""},{"$f":"IF(AG79=\"\",\"\",'Cálc. Sist. Extinção Automática'!AF31)","v":""},"",null,{"$f":"IF(OR($C$58,AG79=\"\"),\"\",'Curvas da Instalação'!$D$22)","v":""},{"$f":"IF(AK79=\"\",\"\",'Cálc. Sist. Extinção Automática'!M31)","v":""},{"$f":"IF(AK79=\"\",\"\",'Cálc. Sist. Extinção Automática'!W31)","v":""},{"$f":"IF(AK79=\"\",\"\",(66.7*AK79/'Cálc. Sist. Extinção Automática'!$B$17)/(PI()*AM79^2))","v":""},"",{"$f":"IF(AK79=\"\",\"\",IF('Cálc. Sist. Extinção Automática'!$M$15=\"\",'Cálc. Sist. Extinção Automática'!$B$18*'Cálc. Sist. Extinção Automática'!$AU$19*AL79*61.7*100000*((AK79/'Cálc. Sist. Extinção Automática'!$B$17)^1.85/('Cálc. Sist. Extinção Automática'!$P$16^1.85*AM79^4.87)),'Cálc. Sist. Extinção Automática'!$B$18*'Cálc. Sist. Extinção Automática'!$AU$19*AL79*((4*'Cálc. Sist. Extinção Automática'!$P$16*((AN79^7)/(AM79/1000))^(1/4))/(AM79/1000))))","v":""}]
[null,null,null,null,null,null,null,null,null,null,null,null,null,null,null,null,null,null,null,null,null,null,8,{"$f":"'Cálc. Sist. Extinção Automática'!B32","v":""},{"$f":"'Cálc. Sist. Extinção Automática'!D32","v":""},"",{"$f":"IF('Cálc. Sist. Extinção Automática'!F32<>\"\",'Cálc. Sist. Extinção Automática'!F32,\"\")","v":""},{"$f":"IF('Cálc. Sist. Extinção Automática'!G32<>\"\",'Cálc. Sist. Extinção Automática'!G32,\"\")","v":""},{"$f":"IF('Cálc. Sist. Extinção Automática'!H32<>\"\",'Cálc. Sist. Extinção Automática'!H32,\"\")","v":""},{"$f":"IF(Z80=\"\",\"\",IF(25-COUNTBLANK('Cálc. Sist. Extinção Automática'!DT32:'Cálc. Sist. Extinção Automática'!ER32)=0,\"\",25-COUNTBLANK('Cálc. Sist. Extinção Automática'!DT32:'Cálc. Sist. Extinção Automática'!ER32)))","v":""},{"$f":"IF(25-COUNTBLANK('Cálc. Sist. Extinção Automática'!DT32:'Cálc. Sist. Extinção Automática'!ER32)=0,\"\",25-COUNTBLANK('Cálc. Sist. Extinção Automática'!DT32:'Cálc. Sist. Extinção Automática'!ER32))","v":""},"",{"$f":"IF(OR(AND(X80=\"c\",Y80=\"s\"),AND(X80=\"c\",AF80=1),AND(X80=\"c\",AC80<'Cálc. Sist. Extinção Automática'!$AU$6)),'Cálc. Sist. Extinção Automática'!AH32,\"\")","v":""},{"$f":"IF(AG80=\"\",\"\",'Cálc. Sist. Extinção Automática'!AF32)","v":""},"",null,{"$f":"IF(OR($C$58,AG80=\"\"),\"\",'Curvas da Instalação'!$D$22)","v":""},{"$f":"IF(AK80=\"\",\"\",'Cálc. Sist. Extinção Automática'!M32)","v":""},{"$f":"IF(AK80=\"\",\"\",'Cálc. Sist. Extinção Automática'!W32)","v":""},{"$f":"IF(AK80=\"\",\"\",(66.7*AK80/'Cálc. Sist. Extinção Automática'!$B$17)/(PI()*AM80^2))","v":""},"",{"$f":"IF(AK80=\"\",\"\",IF('Cálc. Sist. Extinção Automática'!$M$15=\"\",'Cálc. Sist. Extinção Automática'!$B$18*'Cálc. Sist. Extinção Automática'!$AU$19*AL80*61.7*100000*((AK80/'Cálc. Sist. Extinção Automática'!$B$17)^1.85/('Cálc. Sist. Extinção Automática'!$P$16^1.85*AM80^4.87)),'Cálc. Sist. Extinção Automática'!$B$18*'Cálc. Sist. Extinção Automática'!$AU$19*AL80*((4*'Cálc. Sist. Extinção Automática'!$P$16*((AN80^7)/(AM80/1000))^(1/4))/(AM80/1000))))","v":""}]
[null,null,null,null,null,null,null,null,null,null,null,null,null,null,null,null,null,null,null,null,null,null,9,{"$f":"'Cálc. Sist. Extinção Automática'!B33","v":""},{"$f":"'Cálc. Sist. Extinção Automática'!D33","v":""},"",{"$f":"IF('Cálc. Sist. Extinção Automática'!F33<>\"\",'Cálc. Sist. Extinção Automática'!F33,\"\")","v":""},{"$f":"IF('Cálc. Sist. Extinção Automática'!G33<>\"\",'Cálc. Sist. Extinção Automática'!G33,\"\")","v":""},{"$f":"IF('Cálc. Sist. Extinção Automática'!H33<>\"\",'Cálc. Sist. Extinção Automática'!H33,\"\")","v":""},{"$f":"IF(Z81=\"\",\"\",IF(25-COUNTBLANK('Cálc. Sist. Extinção Automática'!DT33:'Cálc. Sist. Extinção Automática'!ER33)=0,\"\",25-COUNTBLANK('Cálc. Sist. Extinção Automática'!DT33:'Cálc. Sist. Extinção Automática'!ER33)))","v":""},{"$f":"IF(25-COUNTBLANK('Cálc. Sist. Extinção Automática'!DT33:'Cálc. Sist. Extinção Automática'!ER33)=0,\"\",25-COUNTBLANK('Cálc. Sist. Extinção Automática'!DT33:'Cálc. Sist. Extinção Automática'!ER33))","v":""},"",{"$f":"IF(OR(AND(X81=\"c\",Y81=\"s\"),AND(X81=\"c\",AF81=1),AND(X81=\"c\",AC81<'Cálc. Sist. Extinção Automática'!$AU$6)),'Cálc. Sist. Extinção Automática'!AH33,\"\")","v":""},{"$f":"IF(AG81=\"\",\"\",'Cálc. Sist. Extinção Automática'!AF33)","v":""},"",null,{"$f":"IF(OR($C$58,AG81=\"\"),\"\",'Curvas da Instalação'!$D$22)","v":""},{"$f":"IF(AK81=\"\",\"\",'Cálc. Sist. Extinção Automática'!M33)","v":""},{"$f":"IF(AK81=\"\",\"\",'Cálc. Sist. Extinção Automática'!W33)","v":""},{"$f":"IF(AK81=\"\",\"\",(66.7*AK81/'Cálc. Sist. Extinção Automática'!$B$17)/(PI()*AM81^2))","v":""},"",{"$f":"IF(AK81=\"\",\"\",IF('Cálc. Sist. Extinção Automática'!$M$15=\"\",'Cálc. Sist. Extinção Automática'!$B$18*'Cálc. Sist. Extinção Automática'!$AU$19*AL81*61.7*100000*((AK81/'Cálc. Sist. Extinção Automática'!$B$17)^1.85/('Cálc. Sist. Extinção Automática'!$P$16^1.85*AM81^4.87)),'Cálc. Sist. Extinção Automática'!$B$18*'Cálc. Sist. Extinção Automática'!$AU$19*AL81*((4*'Cálc. Sist. Extinção Automática'!$P$16*((AN81^7)/(AM81/1000))^(1/4))/(AM81/1000))))","v":""}]
[null,null,null,null,null,null,null,null,null,null,null,null,null,null,null,null,null,null,null,null,null,null,10,{"$f":"'Cálc. Sist. Extinção Automática'!B34","v":""},{"$f":"'Cálc. Sist. Extinção Automática'!D34","v":""},"",{"$f":"IF('Cálc. Sist. Extinção Automática'!F34<>\"\",'Cálc. Sist. Extinção Automática'!F34,\"\")","v":""},{"$f":"IF('Cálc. Sist. Extinção Automática'!G34<>\"\",'Cálc. Sist. Extinção Automática'!G34,\"\")","v":""},{"$f":"IF('Cálc. Sist. Extinção Automática'!H34<>\"\",'Cálc. Sist. Extinção Automática'!H34,\"\")","v":""},{"$f":"IF(Z82=\"\",\"\",IF(25-COUNTBLANK('Cálc. Sist. Extinção Automática'!DT34:'Cálc. Sist. Extinção Automática'!ER34)=0,\"\",25-COUNTBLANK('Cálc. Sist. Extinção Automática'!DT34:'Cálc. Sist. Extinção Automática'!ER34)))","v":""},{"$f":"IF(25-COUNTBLANK('Cálc. Sist. Extinção Automática'!DT34:'Cálc. Sist. Extinção Automática'!ER34)=0,\"\",25-COUNTBLANK('Cálc. Sist. Extinção Automática'!DT34:'Cálc. Sist. Extinção Automática'!ER34))","v":""},"",{"$f":"IF(OR(AND(X82=\"c\",Y82=\"s\"),AND(X82=\"c\",AF82=1),AND(X82=\"c\",AC82<'Cálc. Sist. Extinção Automática'!$AU$6)),'Cálc. Sist. Extinção Automática'!AH34,\"\")","v":""},{"$f":"IF(AG82=\"\",\"\",'Cálc. Sist. Extinção Automática'!AF34)","v":""},"",null,{"$f":"IF(OR($C$58,AG82=\"\"),\"\",'Curvas da Instalação'!$D$22)","v":""},{"$f":"IF(AK82=\"\",\"\",'Cálc. Sist. Extinção Automática'!M34)","v":""},{"$f":"IF(AK82=\"\",\"\",'Cálc. Sist. Extinção Automática'!W34)","v":""},{"$f":"IF(AK82=\"\",\"\",(66.7*AK82/'Cálc. Sist. Extinção Automática'!$B$17)/(PI()*AM82^2))","v":""},"",{"$f":"IF(AK82=\"\",\"\",IF('Cálc. Sist. Extinção Automática'!$M$15=\"\",'Cálc. Sist. Extinção Automática'!$B$18*'Cálc. Sist. Extinção Automática'!$AU$19*AL82*61.7*100000*((AK82/'Cálc. Sist. Extinção Automática'!$B$17)^1.85/('Cálc. Sist. Extinção Automática'!$P$16^1.85*AM82^4.87)),'Cálc. Sist. Extinção Automática'!$B$18*'Cálc. Sist. Extinção Automática'!$AU$19*AL82*((4*'Cálc. Sist. Extinção Automática'!$P$16*((AN82^7)/(AM82/1000))^(1/4))/(AM82/1000))))","v":""}]
[null,null,null,null,null,null,null,null,null,null,null,null,null,null,null,null,null,null,null,null,null,null,11,{"$f":"'Cálc. Sist. Extinção Automática'!B35","v":""},{"$f":"'Cálc. Sist. Extinção Automática'!D35","v":""},"",{"$f":"IF('Cálc. Sist. Extinção Automática'!F35<>\"\",'Cálc. Sist. Extinção Automática'!F35,\"\")","v":""},{"$f":"IF('Cálc. Sist. Extinção Automática'!G35<>\"\",'Cálc. Sist. Extinção Automática'!G35,\"\")","v":""},{"$f":"IF('Cálc. Sist. Extinção Automática'!H35<>\"\",'Cálc. Sist. Extinção Automática'!H35,\"\")","v":""},{"$f":"IF(Z83=\"\",\"\",IF(25-COUNTBLANK('Cálc. Sist. Extinção Automática'!DT35:'Cálc. Sist. Extinção Automática'!ER35)=0,\"\",25-COUNTBLANK('Cálc. Sist. Extinção Automática'!DT35:'Cálc. Sist. Extinção Automática'!ER35)))","v":""},{"$f":"IF(25-COUNTBLANK('Cálc. Sist. Extinção Automática'!DT35:'Cálc. Sist. Extinção Automática'!ER35)=0,\"\",25-COUNTBLANK('Cálc. Sist. Extinção Automática'!DT35:'Cálc. Sist. Extinção Automática'!ER35))","v":""},"",{"$f":"IF(OR(AND(X83=\"c\",Y83=\"s\"),AND(X83=\"c\",AF83=1),AND(X83=\"c\",AC83<'Cálc. Sist. Extinção Automática'!$AU$6)),'Cálc. Sist. Extinção Automática'!AH35,\"\")","v":""},{"$f":"IF(AG83=\"\",\"\",'Cálc. Sist. Extinção Automática'!AF35)","v":""},"",null,{"$f":"IF(OR($C$58,AG83=\"\"),\"\",'Curvas da Instalação'!$D$22)","v":""},{"$f":"IF(AK83=\"\",\"\",'Cálc. Sist. Extinção Automática'!M35)","v":""},{"$f":"IF(AK83=\"\",\"\",'Cálc. Sist. Extinção Automática'!W35)","v":""},{"$f":"IF(AK83=\"\",\"\",(66.7*AK83/'Cálc. Sist. Extinção Automática'!$B$17)/(PI()*AM83^2))","v":""},"",{"$f":"IF(AK83=\"\",\"\",IF('Cálc. Sist. Extinção Automática'!$M$15=\"\",'Cálc. Sist. Extinção Automática'!$B$18*'Cálc. Sist. Extinção Automática'!$AU$19*AL83*61.7*100000*((AK83/'Cálc. Sist. Extinção Automática'!$B$17)^1.85/('Cálc. Sist. Extinção Automática'!$P$16^1.85*AM83^4.87)),'Cálc. Sist. Extinção Automática'!$B$18*'Cálc. Sist. Extinção Automática'!$AU$19*AL83*((4*'Cálc. Sist. Extinção Automática'!$P$16*((AN83^7)/(AM83/1000))^(1/4))/(AM83/1000))))","v":""}]
[null,null,null,null,null,null,null,null,null,null,null,null,null,null,null,null,null,null,null,null,null,null,12,{"$f":"'Cálc. Sist. Extinção Automática'!B36","v":""},{"$f":"'Cálc. Sist. Extinção Automática'!D36","v":""},"",{"$f":"IF('Cálc. Sist. Extinção Automática'!F36<>\"\",'Cálc. Sist. Extinção Automática'!F36,\"\")","v":""},{"$f":"IF('Cálc. Sist. Extinção Automática'!G36<>\"\",'Cálc. Sist. Extinção Automática'!G36,\"\")","v":""},{"$f":"IF('Cálc. Sist. Extinção Automática'!H36<>\"\",'Cálc. Sist. Extinção Automática'!H36,\"\")","v":""},{"$f":"IF(Z84=\"\",\"\",IF(25-COUNTBLANK('Cálc. Sist. Extinção Automática'!DT36:'Cálc. Sist. Extinção Automática'!ER36)=0,\"\",25-COUNTBLANK('Cálc. Sist. Extinção Automática'!DT36:'Cálc. Sist. Extinção Automática'!ER36)))","v":""},{"$f":"IF(25-COUNTBLANK('Cálc. Sist. Extinção Automática'!DT36:'Cálc. Sist. Extinção Automática'!ER36)=0,\"\",25-COUNTBLANK('Cálc. Sist. Extinção Automática'!DT36:'Cálc. Sist. Extinção Automática'!ER36))","v":""},"",{"$f":"IF(OR(AND(X84=\"c\",Y84=\"s\"),AND(X84=\"c\",AF84=1),AND(X84=\"c\",AC84<'Cálc. Sist. Extinção Automática'!$AU$6)),'Cálc. Sist. Extinção Automática'!AH36,\"\")","v":""},{"$f":"IF(AG84=\"\",\"\",'Cálc. Sist. Extinção Automática'!AF36)","v":""},"",null,{"$f":"IF(OR($C$58,AG84=\"\"),\"\",'Curvas da Instalação'!$D$22)","v":""},{"$f":"IF(AK84=\"\",\"\",'Cálc. Sist. Extinção Automática'!M36)","v":""},{"$f":"IF(AK84=\"\",\"\",'Cálc. Sist. Extinção Automática'!W36)","v":""},{"$f":"IF(AK84=\"\",\"\",(66.7*AK84/'Cálc. Sist. Extinção Automática'!$B$17)/(PI()*AM84^2))","v":""},"",{"$f":"IF(AK84=\"\",\"\",IF('Cálc. Sist. Extinção Automática'!$M$15=\"\",'Cálc. Sist. Extinção Automática'!$B$18*'Cálc. Sist. Extinção Automática'!$AU$19*AL84*61.7*100000*((AK84/'Cálc. Sist. Extinção Automática'!$B$17)^1.85/('Cálc. Sist. Extinção Automática'!$P$16^1.85*AM84^4.87)),'Cálc. Sist. Extinção Automática'!$B$18*'Cálc. Sist. Extinção Automática'!$AU$19*AL84*((4*'Cálc. Sist. Extinção Automática'!$P$16*((AN84^7)/(AM84/1000))^(1/4))/(AM84/1000))))","v":""}]
[null,null,null,null,null,null,null,null,null,null,null,null,null,null,null,null,null,null,null,null,null,null,13,{"$f":"'Cálc. Sist. Extinção Automática'!B37","v":""},{"$f":"'Cálc. Sist. Extinção Automática'!D37","v":""},"",{"$f":"IF('Cálc. Sist. Extinção Automática'!F37<>\"\",'Cálc. Sist. Extinção Automática'!F37,\"\")","v":""},{"$f":"IF('Cálc. Sist. Extinção Automática'!G37<>\"\",'Cálc. Sist. Extinção Automática'!G37,\"\")","v":""},{"$f":"IF('Cálc. Sist. Extinção Automática'!H37<>\"\",'Cálc. Sist. Extinção Automática'!H37,\"\")","v":""},{"$f":"IF(Z85=\"\",\"\",IF(25-COUNTBLANK('Cálc. Sist. Extinção Automática'!DT37:'Cálc. Sist. Extinção Automática'!ER37)=0,\"\",25-COUNTBLANK('Cálc. Sist. Extinção Automática'!DT37:'Cálc. Sist. Extinção Automática'!ER37)))","v":""},{"$f":"IF(25-COUNTBLANK('Cálc. Sist. Extinção Automática'!DT37:'Cálc. Sist. Extinção Automática'!ER37)=0,\"\",25-COUNTBLANK('Cálc. Sist. Extinção Automática'!DT37:'Cálc. Sist. Extinção Automática'!ER37))","v":""},"",{"$f":"IF(OR(AND(X85=\"c\",Y85=\"s\"),AND(X85=\"c\",AF85=1),AND(X85=\"c\",AC85<'Cálc. Sist. Extinção Automática'!$AU$6)),'Cálc. Sist. Extinção Automática'!AH37,\"\")","v":""},{"$f":"IF(AG85=\"\",\"\",'Cálc. Sist. Extinção Automática'!AF37)","v":""},"",null,{"$f":"IF(OR($C$58,AG85=\"\"),\"\",'Curvas da Instalação'!$D$22)","v":""},{"$f":"IF(AK85=\"\",\"\",'Cálc. Sist. Extinção Automática'!M37)","v":""},{"$f":"IF(AK85=\"\",\"\",'Cálc. Sist. Extinção Automática'!W37)","v":""},{"$f":"IF(AK85=\"\",\"\",(66.7*AK85/'Cálc. Sist. Extinção Automática'!$B$17)/(PI()*AM85^2))","v":""},"",{"$f":"IF(AK85=\"\",\"\",IF('Cálc. Sist. Extinção Automática'!$M$15=\"\",'Cálc. Sist. Extinção Automática'!$B$18*'Cálc. Sist. Extinção Automática'!$AU$19*AL85*61.7*100000*((AK85/'Cálc. Sist. Extinção Automática'!$B$17)^1.85/('Cálc. Sist. Extinção Automática'!$P$16^1.85*AM85^4.87)),'Cálc. Sist. Extinção Automática'!$B$18*'Cálc. Sist. Extinção Automática'!$AU$19*AL85*((4*'Cálc. Sist. Extinção Automática'!$P$16*((AN85^7)/(AM85/1000))^(1/4))/(AM85/1000))))","v":""}]
[null,null,null,null,null,null,null,null,null,null,null,null,null,null,null,null,null,null,null,null,null,null,14,{"$f":"'Cálc. Sist. Extinção Automática'!B38","v":""},{"$f":"'Cálc. Sist. Extinção Automática'!D38","v":""},"",{"$f":"IF('Cálc. Sist. Extinção Automática'!F38<>\"\",'Cálc. Sist. Extinção Automática'!F38,\"\")","v":""},{"$f":"IF('Cálc. Sist. Extinção Automática'!G38<>\"\",'Cálc. Sist. Extinção Automática'!G38,\"\")","v":""},{"$f":"IF('Cálc. Sist. Extinção Automática'!H38<>\"\",'Cálc. Sist. Extinção Automática'!H38,\"\")","v":""},{"$f":"IF(Z86=\"\",\"\",IF(25-COUNTBLANK('Cálc. Sist. Extinção Automática'!DT38:'Cálc. Sist. Extinção Automática'!ER38)=0,\"\",25-COUNTBLANK('Cálc. Sist. Extinção Automática'!DT38:'Cálc. Sist. Extinção Automática'!ER38)))","v":""},{"$f":"IF(25-COUNTBLANK('Cálc. Sist. Extinção Automática'!DT38:'Cálc. Sist. Extinção Automática'!ER38)=0,\"\",25-COUNTBLANK('Cálc. Sist. Extinção Automática'!DT38:'Cálc. Sist. Extinção Automática'!ER38))","v":""},"",{"$f":"IF(OR(AND(X86=\"c\",Y86=\"s\"),AND(X86=\"c\",AF86=1),AND(X86=\"c\",AC86<'Cálc. Sist. Extinção Automática'!$AU$6)),'Cálc. Sist. Extinção Automática'!AH38,\"\")","v":""},{"$f":"IF(AG86=\"\",\"\",'Cálc. Sist. Extinção Automática'!AF38)","v":""},"",null,{"$f":"IF(OR($C$58,AG86=\"\"),\"\",'Curvas da Instalação'!$D$22)","v":""},{"$f":"IF(AK86=\"\",\"\",'Cálc. Sist. Extinção Automática'!M38)","v":""},{"$f":"IF(AK86=\"\",\"\",'Cálc. Sist. Extinção Automática'!W38)","v":""},{"$f":"IF(AK86=\"\",\"\",(66.7*AK86/'Cálc. Sist. Extinção Automática'!$B$17)/(PI()*AM86^2))","v":""},"",{"$f":"IF(AK86=\"\",\"\",IF('Cálc. Sist. Extinção Automática'!$M$15=\"\",'Cálc. Sist. Extinção Automática'!$B$18*'Cálc. Sist. Extinção Automática'!$AU$19*AL86*61.7*100000*((AK86/'Cálc. Sist. Extinção Automática'!$B$17)^1.85/('Cálc. Sist. Extinção Automática'!$P$16^1.85*AM86^4.87)),'Cálc. Sist. Extinção Automática'!$B$18*'Cálc. Sist. Extinção Automática'!$AU$19*AL86*((4*'Cálc. Sist. Extinção Automática'!$P$16*((AN86^7)/(AM86/1000))^(1/4))/(AM86/1000))))","v":""}]
[null,null,null,null,null,null,null,null,null,null,null,null,null,null,null,null,null,null,null,null,null,null,15,{"$f":"'Cálc. Sist. Extinção Automática'!B39","v":""},{"$f":"'Cálc. Sist. Extinção Automática'!D39","v":""},"",{"$f":"IF('Cálc. Sist. Extinção Automática'!F39<>\"\",'Cálc. Sist. Extinção Automática'!F39,\"\")","v":""},{"$f":"IF('Cálc. Sist. Extinção Automática'!G39<>\"\",'Cálc. Sist. Extinção Automática'!G39,\"\")","v":""},{"$f":"IF('Cálc. Sist. Extinção Automática'!H39<>\"\",'Cálc. Sist. Extinção Automática'!H39,\"\")","v":""},{"$f":"IF(Z87=\"\",\"\",IF(25-COUNTBLANK('Cálc. Sist. Extinção Automática'!DT39:'Cálc. Sist. Extinção Automática'!ER39)=0,\"\",25-COUNTBLANK('Cálc. Sist. Extinção Automática'!DT39:'Cálc. Sist. Extinção Automática'!ER39)))","v":""},{"$f":"IF(25-COUNTBLANK('Cálc. Sist. Extinção Automática'!DT39:'Cálc. Sist. Extinção Automática'!ER39)=0,\"\",25-COUNTBLANK('Cálc. Sist. Extinção Automática'!DT39:'Cálc. Sist. Extinção Automática'!ER39))","v":""},"",{"$f":"IF(OR(AND(X87=\"c\",Y87=\"s\"),AND(X87=\"c\",AF87=1),AND(X87=\"c\",AC87<'Cálc. Sist. Extinção Automática'!$AU$6)),'Cálc. Sist. Extinção Automática'!AH39,\"\")","v":""},{"$f":"IF(AG87=\"\",\"\",'Cálc. Sist. Extinção Automática'!AF39)","v":""},"",null,{"$f":"IF(OR($C$58,AG87=\"\"),\"\",'Curvas da Instalação'!$D$22)","v":""},{"$f":"IF(AK87=\"\",\"\",'Cálc. Sist. Extinção Automática'!M39)","v":""},{"$f":"IF(AK87=\"\",\"\",'Cálc. Sist. Extinção Automática'!W39)","v":""},{"$f":"IF(AK87=\"\",\"\",(66.7*AK87/'Cálc. Sist. Extinção Automática'!$B$17)/(PI()*AM87^2))","v":""},"",{"$f":"IF(AK87=\"\",\"\",IF('Cálc. Sist. Extinção Automática'!$M$15=\"\",'Cálc. Sist. Extinção Automática'!$B$18*'Cálc. Sist. Extinção Automática'!$AU$19*AL87*61.7*100000*((AK87/'Cálc. Sist. Extinção Automática'!$B$17)^1.85/('Cálc. Sist. Extinção Automática'!$P$16^1.85*AM87^4.87)),'Cálc. Sist. Extinção Automática'!$B$18*'Cálc. Sist. Extinção Automática'!$AU$19*AL87*((4*'Cálc. Sist. Extinção Automática'!$P$16*((AN87^7)/(AM87/1000))^(1/4))/(AM87/1000))))","v":""}]
[null,null,null,null,null,null,null,null,null,null,null,null,null,null,null,null,null,null,null,null,null,null,16,{"$f":"'Cálc. Sist. Extinção Automática'!B40","v":""},{"$f":"'Cálc. Sist. Extinção Automática'!D40","v":""},"",{"$f":"IF('Cálc. Sist. Extinção Automática'!F40<>\"\",'Cálc. Sist. Extinção Automática'!F40,\"\")","v":""},{"$f":"IF('Cálc. Sist. Extinção Automática'!G40<>\"\",'Cálc. Sist. Extinção Automática'!G40,\"\")","v":""},{"$f":"IF('Cálc. Sist. Extinção Automática'!H40<>\"\",'Cálc. Sist. Extinção Automática'!H40,\"\")","v":""},{"$f":"IF(Z88=\"\",\"\",IF(25-COUNTBLANK('Cálc. Sist. Extinção Automática'!DT40:'Cálc. Sist. Extinção Automática'!ER40)=0,\"\",25-COUNTBLANK('Cálc. Sist. Extinção Automática'!DT40:'Cálc. Sist. Extinção Automática'!ER40)))","v":""},{"$f":"IF(25-COUNTBLANK('Cálc. Sist. Extinção Automática'!DT40:'Cálc. Sist. Extinção Automática'!ER40)=0,\"\",25-COUNTBLANK('Cálc. Sist. Extinção Automática'!DT40:'Cálc. Sist. Extinção Automática'!ER40))","v":""},"",{"$f":"IF(OR(AND(X88=\"c\",Y88=\"s\"),AND(X88=\"c\",AF88=1),AND(X88=\"c\",AC88<'Cálc. Sist. Extinção Automática'!$AU$6)),'Cálc. Sist. Extinção Automática'!AH40,\"\")","v":""},{"$f":"IF(AG88=\"\",\"\",'Cálc. Sist. Extinção Automática'!AF40)","v":""},"",null,{"$f":"IF(OR($C$58,AG88=\"\"),\"\",'Curvas da Instalação'!$D$22)","v":""},{"$f":"IF(AK88=\"\",\"\",'Cálc. Sist. Extinção Automática'!M40)","v":""},{"$f":"IF(AK88=\"\",\"\",'Cálc. Sist. Extinção Automática'!W40)","v":""},{"$f":"IF(AK88=\"\",\"\",(66.7*AK88/'Cálc. Sist. Extinção Automática'!$B$17)/(PI()*AM88^2))","v":""},"",{"$f":"IF(AK88=\"\",\"\",IF('Cálc. Sist. Extinção Automática'!$M$15=\"\",'Cálc. Sist. Extinção Automática'!$B$18*'Cálc. Sist. Extinção Automática'!$AU$19*AL88*61.7*100000*((AK88/'Cálc. Sist. Extinção Automática'!$B$17)^1.85/('Cálc. Sist. Extinção Automática'!$P$16^1.85*AM88^4.87)),'Cálc. Sist. Extinção Automática'!$B$18*'Cálc. Sist. Extinção Automática'!$AU$19*AL88*((4*'Cálc. Sist. Extinção Automática'!$P$16*((AN88^7)/(AM88/1000))^(1/4))/(AM88/1000))))","v":""}]
[null,null,null,null,null,null,null,null,null,null,null,null,null,null,null,null,null,null,null,null,null,null,17,{"$f":"'Cálc. Sist. Extinção Automática'!B41","v":""},{"$f":"'Cálc. Sist. Extinção Automática'!D41","v":""},"",{"$f":"IF('Cálc. Sist. Extinção Automática'!F41<>\"\",'Cálc. Sist. Extinção Automática'!F41,\"\")","v":""},{"$f":"IF('Cálc. Sist. Extinção Automática'!G41<>\"\",'Cálc. Sist. Extinção Automática'!G41,\"\")","v":""},{"$f":"IF('Cálc. Sist. Extinção Automática'!H41<>\"\",'Cálc. Sist. Extinção Automática'!H41,\"\")","v":""},{"$f":"IF(Z89=\"\",\"\",IF(25-COUNTBLANK('Cálc. Sist. Extinção Automática'!DT41:'Cálc. Sist. Extinção Automática'!ER41)=0,\"\",25-COUNTBLANK('Cálc. Sist. Extinção Automática'!DT41:'Cálc. Sist. Extinção Automática'!ER41)))","v":""},{"$f":"IF(25-COUNTBLANK('Cálc. Sist. Extinção Automática'!DT41:'Cálc. Sist. Extinção Automática'!ER41)=0,\"\",25-COUNTBLANK('Cálc. Sist. Extinção Automática'!DT41:'Cálc. Sist. Extinção Automática'!ER41))","v":""},"",{"$f":"IF(OR(AND(X89=\"c\",Y89=\"s\"),AND(X89=\"c\",AF89=1),AND(X89=\"c\",AC89<'Cálc. Sist. Extinção Automática'!$AU$6)),'Cálc. Sist. Extinção Automática'!AH41,\"\")","v":""},{"$f":"IF(AG89=\"\",\"\",'Cálc. Sist. Extinção Automática'!AF41)","v":""},"",null,{"$f":"IF(OR($C$58,AG89=\"\"),\"\",'Curvas da Instalação'!$D$22)","v":""},{"$f":"IF(AK89=\"\",\"\",'Cálc. Sist. Extinção Automática'!M41)","v":""},{"$f":"IF(AK89=\"\",\"\",'Cálc. Sist. Extinção Automática'!W41)","v":""},{"$f":"IF(AK89=\"\",\"\",(66.7*AK89/'Cálc. Sist. Extinção Automática'!$B$17)/(PI()*AM89^2))","v":""},"",{"$f":"IF(AK89=\"\",\"\",IF('Cálc. Sist. Extinção Automática'!$M$15=\"\",'Cálc. Sist. Extinção Automática'!$B$18*'Cálc. Sist. Extinção Automática'!$AU$19*AL89*61.7*100000*((AK89/'Cálc. Sist. Extinção Automática'!$B$17)^1.85/('Cálc. Sist. Extinção Automática'!$P$16^1.85*AM89^4.87)),'Cálc. Sist. Extinção Automática'!$B$18*'Cálc. Sist. Extinção Automática'!$AU$19*AL89*((4*'Cálc. Sist. Extinção Automática'!$P$16*((AN89^7)/(AM89/1000))^(1/4))/(AM89/1000))))","v":""}]
[null,null,null,null,null,null,null,null,null,null,null,null,null,null,null,null,null,null,null,null,null,null,18,{"$f":"'Cálc. Sist. Extinção Automática'!B42","v":""},{"$f":"'Cálc. Sist. Extinção Automática'!D42","v":""},"",{"$f":"IF('Cálc. Sist. Extinção Automática'!F42<>\"\",'Cálc. Sist. Extinção Automática'!F42,\"\")","v":""},{"$f":"IF('Cálc. Sist. Extinção Automática'!G42<>\"\",'Cálc. Sist. Extinção Automática'!G42,\"\")","v":""},{"$f":"IF('Cálc. Sist. Extinção Automática'!H42<>\"\",'Cálc. Sist. Extinção Automática'!H42,\"\")","v":""},{"$f":"IF(Z90=\"\",\"\",IF(25-COUNTBLANK('Cálc. Sist. Extinção Automática'!DT42:'Cálc. Sist. Extinção Automática'!ER42)=0,\"\",25-COUNTBLANK('Cálc. Sist. Extinção Automática'!DT42:'Cálc. Sist. Extinção Automática'!ER42)))","v":""},{"$f":"IF(25-COUNTBLANK('Cálc. Sist. Extinção Automática'!DT42:'Cálc. Sist. Extinção Automática'!ER42)=0,\"\",25-COUNTBLANK('Cálc. Sist. Extinção Automática'!DT42:'Cálc. Sist. Extinção Automática'!ER42))","v":""},"",{"$f":"IF(OR(AND(X90=\"c\",Y90=\"s\"),AND(X90=\"c\",AF90=1),AND(X90=\"c\",AC90<'Cálc. Sist. Extinção Automática'!$AU$6)),'Cálc. Sist. Extinção Automática'!AH42,\"\")","v":""},{"$f":"IF(AG90=\"\",\"\",'Cálc. Sist. Extinção Automática'!AF42)","v":""},"",null,{"$f":"IF(OR($C$58,AG90=\"\"),\"\",'Curvas da Instalação'!$D$22)","v":""},{"$f":"IF(AK90=\"\",\"\",'Cálc. Sist. Extinção Automática'!M42)","v":""},{"$f":"IF(AK90=\"\",\"\",'Cálc. Sist. Extinção Automática'!W42)","v":""},{"$f":"IF(AK90=\"\",\"\",(66.7*AK90/'Cálc. Sist. Extinção Automática'!$B$17)/(PI()*AM90^2))","v":""},"",{"$f":"IF(AK90=\"\",\"\",IF('Cálc. Sist. Extinção Automática'!$M$15=\"\",'Cálc. Sist. Extinção Automática'!$B$18*'Cálc. Sist. Extinção Automática'!$AU$19*AL90*61.7*100000*((AK90/'Cálc. Sist. Extinção Automática'!$B$17)^1.85/('Cálc. Sist. Extinção Automática'!$P$16^1.85*AM90^4.87)),'Cálc. Sist. Extinção Automática'!$B$18*'Cálc. Sist. Extinção Automática'!$AU$19*AL90*((4*'Cálc. Sist. Extinção Automática'!$P$16*((AN90^7)/(AM90/1000))^(1/4))/(AM90/1000))))","v":""}]
[null,null,null,null,null,null,null,null,null,null,null,null,null,null,null,null,null,null,null,null,null,null,19,{"$f":"'Cálc. Sist. Extinção Automática'!B43","v":""},{"$f":"'Cálc. Sist. Extinção Automática'!D43","v":""},"",{"$f":"IF('Cálc. Sist. Extinção Automática'!F43<>\"\",'Cálc. Sist. Extinção Automática'!F43,\"\")","v":""},{"$f":"IF('Cálc. Sist. Extinção Automática'!G43<>\"\",'Cálc. Sist. Extinção Automática'!G43,\"\")","v":""},{"$f":"IF('Cálc. Sist. Extinção Automática'!H43<>\"\",'Cálc. Sist. Extinção Automática'!H43,\"\")","v":""},{"$f":"IF(Z91=\"\",\"\",IF(25-COUNTBLANK('Cálc. Sist. Extinção Automática'!DT43:'Cálc. Sist. Extinção Automática'!ER43)=0,\"\",25-COUNTBLANK('Cálc. Sist. Extinção Automática'!DT43:'Cálc. Sist. Extinção Automática'!ER43)))","v":""},{"$f":"IF(25-COUNTBLANK('Cálc. Sist. Extinção Automática'!DT43:'Cálc. Sist. Extinção Automática'!ER43)=0,\"\",25-COUNTBLANK('Cálc. Sist. Extinção Automática'!DT43:'Cálc. Sist. Extinção Automática'!ER43))","v":""},"",{"$f":"IF(OR(AND(X91=\"c\",Y91=\"s\"),AND(X91=\"c\",AF91=1),AND(X91=\"c\",AC91<'Cálc. Sist. Extinção Automática'!$AU$6)),'Cálc. Sist. Extinção Automática'!AH43,\"\")","v":""},{"$f":"IF(AG91=\"\",\"\",'Cálc. Sist. Extinção Automática'!AF43)","v":""},"",null,{"$f":"IF(OR($C$58,AG91=\"\"),\"\",'Curvas da Instalação'!$D$22)","v":""},{"$f":"IF(AK91=\"\",\"\",'Cálc. Sist. Extinção Automática'!M43)","v":""},{"$f":"IF(AK91=\"\",\"\",'Cálc. Sist. Extinção Automática'!W43)","v":""},{"$f":"IF(AK91=\"\",\"\",(66.7*AK91/'Cálc. Sist. Extinção Automática'!$B$17)/(PI()*AM91^2))","v":""},"",{"$f":"IF(AK91=\"\",\"\",IF('Cálc. Sist. Extinção Automática'!$M$15=\"\",'Cálc. Sist. Extinção Automática'!$B$18*'Cálc. Sist. Extinção Automática'!$AU$19*AL91*61.7*100000*((AK91/'Cálc. Sist. Extinção Automática'!$B$17)^1.85/('Cálc. Sist. Extinção Automática'!$P$16^1.85*AM91^4.87)),'Cálc. Sist. Extinção Automática'!$B$18*'Cálc. Sist. Extinção Automática'!$AU$19*AL91*((4*'Cálc. Sist. Extinção Automática'!$P$16*((AN91^7)/(AM91/1000))^(1/4))/(AM91/1000))))","v":""}]
[null,null,null,null,null,null,null,null,null,null,null,null,null,null,null,null,null,null,null,null,null,null,20,{"$f":"'Cálc. Sist. Extinção Automática'!B44","v":""},{"$f":"'Cálc. Sist. Extinção Automática'!D44","v":""},"",{"$f":"IF('Cálc. Sist. Extinção Automática'!F44<>\"\",'Cálc. Sist. Extinção Automática'!F44,\"\")","v":""},{"$f":"IF('Cálc. Sist. Extinção Automática'!G44<>\"\",'Cálc. Sist. Extinção Automática'!G44,\"\")","v":""},{"$f":"IF('Cálc. Sist. Extinção Automática'!H44<>\"\",'Cálc. Sist. Extinção Automática'!H44,\"\")","v":""},{"$f":"IF(Z92=\"\",\"\",IF(25-COUNTBLANK('Cálc. Sist. Extinção Automática'!DT44:'Cálc. Sist. Extinção Automática'!ER44)=0,\"\",25-COUNTBLANK('Cálc. Sist. Extinção Automática'!DT44:'Cálc. Sist. Extinção Automática'!ER44)))","v":""},{"$f":"IF(25-COUNTBLANK('Cálc. Sist. Extinção Automática'!DT44:'Cálc. Sist. Extinção Automática'!ER44)=0,\"\",25-COUNTBLANK('Cálc. Sist. Extinção Automática'!DT44:'Cálc. Sist. Extinção Automática'!ER44))","v":""},"",{"$f":"IF(OR(AND(X92=\"c\",Y92=\"s\"),AND(X92=\"c\",AF92=1),AND(X92=\"c\",AC92<'Cálc. Sist. Extinção Automática'!$AU$6)),'Cálc. Sist. Extinção Automática'!AH44,\"\")","v":""},{"$f":"IF(AG92=\"\",\"\",'Cálc. Sist. Extinção Automática'!AF44)","v":""},"",null,{"$f":"IF(OR($C$58,AG92=\"\"),\"\",'Curvas da Instalação'!$D$22)","v":""},{"$f":"IF(AK92=\"\",\"\",'Cálc. Sist. Extinção Automática'!M44)","v":""},{"$f":"IF(AK92=\"\",\"\",'Cálc. Sist. Extinção Automática'!W44)","v":""},{"$f":"IF(AK92=\"\",\"\",(66.7*AK92/'Cálc. Sist. Extinção Automática'!$B$17)/(PI()*AM92^2))","v":""},"",{"$f":"IF(AK92=\"\",\"\",IF('Cálc. Sist. Extinção Automática'!$M$15=\"\",'Cálc. Sist. Extinção Automática'!$B$18*'Cálc. Sist. Extinção Automática'!$AU$19*AL92*61.7*100000*((AK92/'Cálc. Sist. Extinção Automática'!$B$17)^1.85/('Cálc. Sist. Extinção Automática'!$P$16^1.85*AM92^4.87)),'Cálc. Sist. Extinção Automática'!$B$18*'Cálc. Sist. Extinção Automática'!$AU$19*AL92*((4*'Cálc. Sist. Extinção Automática'!$P$16*((AN92^7)/(AM92/1000))^(1/4))/(AM92/1000))))","v":""}]
[null,null,null,null,null,null,null,null,null,null,null,null,null,null,null,null,null,null,null,null,null,null,21,{"$f":"'Cálc. Sist. Extinção Automática'!B45","v":""},{"$f":"'Cálc. Sist. Extinção Automática'!D45","v":""},"",{"$f":"IF('Cálc. Sist. Extinção Automática'!F45<>\"\",'Cálc. Sist. Extinção Automática'!F45,\"\")","v":""},{"$f":"IF('Cálc. Sist. Extinção Automática'!G45<>\"\",'Cálc. Sist. Extinção Automática'!G45,\"\")","v":""},{"$f":"IF('Cálc. Sist. Extinção Automática'!H45<>\"\",'Cálc. Sist. Extinção Automática'!H45,\"\")","v":""},{"$f":"IF(Z93=\"\",\"\",IF(25-COUNTBLANK('Cálc. Sist. Extinção Automática'!DT45:'Cálc. Sist. Extinção Automática'!ER45)=0,\"\",25-COUNTBLANK('Cálc. Sist. Extinção Automática'!DT45:'Cálc. Sist. Extinção Automática'!ER45)))","v":""},{"$f":"IF(25-COUNTBLANK('Cálc. Sist. Extinção Automática'!DT45:'Cálc. Sist. Extinção Automática'!ER45)=0,\"\",25-COUNTBLANK('Cálc. Sist. Extinção Automática'!DT45:'Cálc. Sist. Extinção Automática'!ER45))","v":""},"",{"$f":"IF(OR(AND(X93=\"c\",Y93=\"s\"),AND(X93=\"c\",AF93=1),AND(X93=\"c\",AC93<'Cálc. Sist. Extinção Automática'!$AU$6)),'Cálc. Sist. Extinção Automática'!AH45,\"\")","v":""},{"$f":"IF(AG93=\"\",\"\",'Cálc. Sist. Extinção Automática'!AF45)","v":""},"",null,{"$f":"IF(OR($C$58,AG93=\"\"),\"\",'Curvas da Instalação'!$D$22)","v":""},{"$f":"IF(AK93=\"\",\"\",'Cálc. Sist. Extinção Automática'!M45)","v":""},{"$f":"IF(AK93=\"\",\"\",'Cálc. Sist. Extinção Automática'!W45)","v":""},{"$f":"IF(AK93=\"\",\"\",(66.7*AK93/'Cálc. Sist. Extinção Automática'!$B$17)/(PI()*AM93^2))","v":""},"",{"$f":"IF(AK93=\"\",\"\",IF('Cálc. Sist. Extinção Automática'!$M$15=\"\",'Cálc. Sist. Extinção Automática'!$B$18*'Cálc. Sist. Extinção Automática'!$AU$19*AL93*61.7*100000*((AK93/'Cálc. Sist. Extinção Automática'!$B$17)^1.85/('Cálc. Sist. Extinção Automática'!$P$16^1.85*AM93^4.87)),'Cálc. Sist. Extinção Automática'!$B$18*'Cálc. Sist. Extinção Automática'!$AU$19*AL93*((4*'Cálc. Sist. Extinção Automática'!$P$16*((AN93^7)/(AM93/1000))^(1/4))/(AM93/1000))))","v":""}]
[null,null,null,null,null,null,null,null,null,null,null,null,null,null,null,null,null,null,null,null,null,null,22,{"$f":"'Cálc. Sist. Extinção Automática'!B46","v":""},{"$f":"'Cálc. Sist. Extinção Automática'!D46","v":""},"",{"$f":"IF('Cálc. Sist. Extinção Automática'!F46<>\"\",'Cálc. Sist. Extinção Automática'!F46,\"\")","v":""},{"$f":"IF('Cálc. Sist. Extinção Automática'!G46<>\"\",'Cálc. Sist. Extinção Automática'!G46,\"\")","v":""},{"$f":"IF('Cálc. Sist. Extinção Automática'!H46<>\"\",'Cálc. Sist. Extinção Automática'!H46,\"\")","v":""},{"$f":"IF(Z94=\"\",\"\",IF(25-COUNTBLANK('Cálc. Sist. Extinção Automática'!DT46:'Cálc. Sist. Extinção Automática'!ER46)=0,\"\",25-COUNTBLANK('Cálc. Sist. Extinção Automática'!DT46:'Cálc. Sist. Extinção Automática'!ER46)))","v":""},{"$f":"IF(25-COUNTBLANK('Cálc. Sist. Extinção Automática'!DT46:'Cálc. Sist. Extinção Automática'!ER46)=0,\"\",25-COUNTBLANK('Cálc. Sist. Extinção Automática'!DT46:'Cálc. Sist. Extinção Automática'!ER46))","v":""},"",{"$f":"IF(OR(AND(X94=\"c\",Y94=\"s\"),AND(X94=\"c\",AF94=1),AND(X94=\"c\",AC94<'Cálc. Sist. Extinção Automática'!$AU$6)),'Cálc. Sist. Extinção Automática'!AH46,\"\")","v":""},{"$f":"IF(AG94=\"\",\"\",'Cálc. Sist. Extinção Automática'!AF46)","v":""},"",null,{"$f":"IF(OR($C$58,AG94=\"\"),\"\",'Curvas da Instalação'!$D$22)","v":""},{"$f":"IF(AK94=\"\",\"\",'Cálc. Sist. Extinção Automática'!M46)","v":""},{"$f":"IF(AK94=\"\",\"\",'Cálc. Sist. Extinção Automática'!W46)","v":""},{"$f":"IF(AK94=\"\",\"\",(66.7*AK94/'Cálc. Sist. Extinção Automática'!$B$17)/(PI()*AM94^2))","v":""},"",{"$f":"IF(AK94=\"\",\"\",IF('Cálc. Sist. Extinção Automática'!$M$15=\"\",'Cálc. Sist. Extinção Automática'!$B$18*'Cálc. Sist. Extinção Automática'!$AU$19*AL94*61.7*100000*((AK94/'Cálc. Sist. Extinção Automática'!$B$17)^1.85/('Cálc. Sist. Extinção Automática'!$P$16^1.85*AM94^4.87)),'Cálc. Sist. Extinção Automática'!$B$18*'Cálc. Sist. Extinção Automática'!$AU$19*AL94*((4*'Cálc. Sist. Extinção Automática'!$P$16*((AN94^7)/(AM94/1000))^(1/4))/(AM94/1000))))","v":""}]
[null,null,null,null,null,null,null,null,null,null,null,null,null,null,null,null,null,null,null,null,null,null,23,{"$f":"'Cálc. Sist. Extinção Automática'!B47","v":""},{"$f":"'Cálc. Sist. Extinção Automática'!D47","v":""},"",{"$f":"IF('Cálc. Sist. Extinção Automática'!F47<>\"\",'Cálc. Sist. Extinção Automática'!F47,\"\")","v":""},{"$f":"IF('Cálc. Sist. Extinção Automática'!G47<>\"\",'Cálc. Sist. Extinção Automática'!G47,\"\")","v":""},{"$f":"IF('Cálc. Sist. Extinção Automática'!H47<>\"\",'Cálc. Sist. Extinção Automática'!H47,\"\")","v":""},{"$f":"IF(Z95=\"\",\"\",IF(25-COUNTBLANK('Cálc. Sist. Extinção Automática'!DT47:'Cálc. Sist. Extinção Automática'!ER47)=0,\"\",25-COUNTBLANK('Cálc. Sist. Extinção Automática'!DT47:'Cálc. Sist. Extinção Automática'!ER47)))","v":""},{"$f":"IF(25-COUNTBLANK('Cálc. Sist. Extinção Automática'!DT47:'Cálc. Sist. Extinção Automática'!ER47)=0,\"\",25-COUNTBLANK('Cálc. Sist. Extinção Automática'!DT47:'Cálc. Sist. Extinção Automática'!ER47))","v":""},"",{"$f":"IF(OR(AND(X95=\"c\",Y95=\"s\"),AND(X95=\"c\",AF95=1),AND(X95=\"c\",AC95<'Cálc. Sist. Extinção Automática'!$AU$6)),'Cálc. Sist. Extinção Automática'!AH47,\"\")","v":""},{"$f":"IF(AG95=\"\",\"\",'Cálc. Sist. Extinção Automática'!AF47)","v":""},"",null,{"$f":"IF(OR($C$58,AG95=\"\"),\"\",'Curvas da Instalação'!$D$22)","v":""},{"$f":"IF(AK95=\"\",\"\",'Cálc. Sist. Extinção Automática'!M47)","v":""},{"$f":"IF(AK95=\"\",\"\",'Cálc. Sist. Extinção Automática'!W47)","v":""},{"$f":"IF(AK95=\"\",\"\",(66.7*AK95/'Cálc. Sist. Extinção Automática'!$B$17)/(PI()*AM95^2))","v":""},"",{"$f":"IF(AK95=\"\",\"\",IF('Cálc. Sist. Extinção Automática'!$M$15=\"\",'Cálc. Sist. Extinção Automática'!$B$18*'Cálc. Sist. Extinção Automática'!$AU$19*AL95*61.7*100000*((AK95/'Cálc. Sist. Extinção Automática'!$B$17)^1.85/('Cálc. Sist. Extinção Automática'!$P$16^1.85*AM95^4.87)),'Cálc. Sist. Extinção Automática'!$B$18*'Cálc. Sist. Extinção Automática'!$AU$19*AL95*((4*'Cálc. Sist. Extinção Automática'!$P$16*((AN95^7)/(AM95/1000))^(1/4))/(AM95/1000))))","v":""}]
[null,null,null,null,null,null,null,null,null,null,null,null,null,null,null,null,null,null,null,null,null,null,24,{"$f":"'Cálc. Sist. Extinção Automática'!B48","v":""},{"$f":"'Cálc. Sist. Extinção Automática'!D48","v":""},"",{"$f":"IF('Cálc. Sist. Extinção Automática'!F48<>\"\",'Cálc. Sist. Extinção Automática'!F48,\"\")","v":""},{"$f":"IF('Cálc. Sist. Extinção Automática'!G48<>\"\",'Cálc. Sist. Extinção Automática'!G48,\"\")","v":""},{"$f":"IF('Cálc. Sist. Extinção Automática'!H48<>\"\",'Cálc. Sist. Extinção Automática'!H48,\"\")","v":""},{"$f":"IF(Z96=\"\",\"\",IF(25-COUNTBLANK('Cálc. Sist. Extinção Automática'!DT48:'Cálc. Sist. Extinção Automática'!ER48)=0,\"\",25-COUNTBLANK('Cálc. Sist. Extinção Automática'!DT48:'Cálc. Sist. Extinção Automática'!ER48)))","v":""},{"$f":"IF(25-COUNTBLANK('Cálc. Sist. Extinção Automática'!DT48:'Cálc. Sist. Extinção Automática'!ER48)=0,\"\",25-COUNTBLANK('Cálc. Sist. Extinção Automática'!DT48:'Cálc. Sist. Extinção Automática'!ER48))","v":""},"",{"$f":"IF(OR(AND(X96=\"c\",Y96=\"s\"),AND(X96=\"c\",AF96=1),AND(X96=\"c\",AC96<'Cálc. Sist. Extinção Automática'!$AU$6)),'Cálc. Sist. Extinção Automática'!AH48,\"\")","v":""},{"$f":"IF(AG96=\"\",\"\",'Cálc. Sist. Extinção Automática'!AF48)","v":""},"",null,{"$f":"IF(OR($C$58,AG96=\"\"),\"\",'Curvas da Instalação'!$D$22)","v":""},{"$f":"IF(AK96=\"\",\"\",'Cálc. Sist. Extinção Automática'!M48)","v":""},{"$f":"IF(AK96=\"\",\"\",'Cálc. Sist. Extinção Automática'!W48)","v":""},{"$f":"IF(AK96=\"\",\"\",(66.7*AK96/'Cálc. Sist. Extinção Automática'!$B$17)/(PI()*AM96^2))","v":""},"",{"$f":"IF(AK96=\"\",\"\",IF('Cálc. Sist. Extinção Automática'!$M$15=\"\",'Cálc. Sist. Extinção Automática'!$B$18*'Cálc. Sist. Extinção Automática'!$AU$19*AL96*61.7*100000*((AK96/'Cálc. Sist. Extinção Automática'!$B$17)^1.85/('Cálc. Sist. Extinção Automática'!$P$16^1.85*AM96^4.87)),'Cálc. Sist. Extinção Automática'!$B$18*'Cálc. Sist. Extinção Automática'!$AU$19*AL96*((4*'Cálc. Sist. Extinção Automática'!$P$16*((AN96^7)/(AM96/1000))^(1/4))/(AM96/1000))))","v":""}]
[null,null,null,null,null,null,null,null,null,null,null,null,null,null,null,null,null,null,null,null,null,null,25,{"$f":"'Cálc. Sist. Extinção Automática'!B49","v":""},{"$f":"'Cálc. Sist. Extinção Automática'!D49","v":""},"",{"$f":"IF('Cálc. Sist. Extinção Automática'!F49<>\"\",'Cálc. Sist. Extinção Automática'!F49,\"\")","v":""},{"$f":"IF('Cálc. Sist. Extinção Automática'!G49<>\"\",'Cálc. Sist. Extinção Automática'!G49,\"\")","v":""},{"$f":"IF('Cálc. Sist. Extinção Automática'!H49<>\"\",'Cálc. Sist. Extinção Automática'!H49,\"\")","v":""},{"$f":"IF(Z97=\"\",\"\",IF(25-COUNTBLANK('Cálc. Sist. Extinção Automática'!DT49:'Cálc. Sist. Extinção Automática'!ER49)=0,\"\",25-COUNTBLANK('Cálc. Sist. Extinção Automática'!DT49:'Cálc. Sist. Extinção Automática'!ER49)))","v":""},{"$f":"IF(25-COUNTBLANK('Cálc. Sist. Extinção Automática'!DT49:'Cálc. Sist. Extinção Automática'!ER49)=0,\"\",25-COUNTBLANK('Cálc. Sist. Extinção Automática'!DT49:'Cálc. Sist. Extinção Automática'!ER49))","v":""},"",{"$f":"IF(OR(AND(X97=\"c\",Y97=\"s\"),AND(X97=\"c\",AF97=1),AND(X97=\"c\",AC97<'Cálc. Sist. Extinção Automática'!$AU$6)),'Cálc. Sist. Extinção Automática'!AH49,\"\")","v":""},{"$f":"IF(AG97=\"\",\"\",'Cálc. Sist. Extinção Automática'!AF49)","v":""},"",null,{"$f":"IF(OR($C$58,AG97=\"\"),\"\",'Curvas da Instalação'!$D$22)","v":""},{"$f":"IF(AK97=\"\",\"\",'Cálc. Sist. Extinção Automática'!M49)","v":""},{"$f":"IF(AK97=\"\",\"\",'Cálc. Sist. Extinção Automática'!W49)","v":""},{"$f":"IF(AK97=\"\",\"\",(66.7*AK97/'Cálc. Sist. Extinção Automática'!$B$17)/(PI()*AM97^2))","v":""},"",{"$f":"IF(AK97=\"\",\"\",IF('Cálc. Sist. Extinção Automática'!$M$15=\"\",'Cálc. Sist. Extinção Automática'!$B$18*'Cálc. Sist. Extinção Automática'!$AU$19*AL97*61.7*100000*((AK97/'Cálc. Sist. Extinção Automática'!$B$17)^1.85/('Cálc. Sist. Extinção Automática'!$P$16^1.85*AM97^4.87)),'Cálc. Sist. Extinção Automática'!$B$18*'Cálc. Sist. Extinção Automática'!$AU$19*AL97*((4*'Cálc. Sist. Extinção Automática'!$P$16*((AN97^7)/(AM97/1000))^(1/4))/(AM97/1000))))","v":""}]
[]
[]
[null,null,"Ponto de func. mais crítico (total de sprinklers em simultâneo)"]
[null,null,null,"Critérios arredondamento"]
[null,null,null,"Pressão","Caudal"]
[null,null,"Curvas da instalação mais críticas em pressão",{"$f":"IF(OR('Cálc. Sist. Extinção Automática'!$BJ$4=2,'Cálc. Sist. Extinção Automática'!$BJ$4=4),2,IF('Cálc. Sist. Extinção Automática'!$BJ$4=3,1,0.1))","v":0.1},{"$f":"IF(OR('Cálc. Sist. Extinção Automática'!$BC$4=2,'Cálc. Sist. Extinção Automática'!$BC$4=4),1,IF('Cálc. Sist. Extinção Automática'!$BC$4=3,0.1,0.1))","v":0.1},"Qmáx.",{"$f":"IF(D17=\"\",\"\",IF($B$39=\"x\",0,ROUND(D17,$E$103)))","v":""},{"$f":"G103&\" \"&'Cálc. Sist. Extinção Automática'!$BG$4","v":" l/min"}]
[null,null,null,{"$f":"'Cálc. Sist. Extinção Automática'!$BJ$4","v":1},{"$f":"'Cálc. Sist. Extinção Automática'!$BC$4","v":1},"Ptotal",{"$f":"IF(D17=\"\",\"\",IF($B$39=\"x\",0,ROUND($E$17+$F$17*D17^1.85,D103)))","v":""},{"$f":"G104&\" \"&'Cálc. Sist. Extinção Automática'!$BL$4","v":" kPa"}]
[null,null,null,null,null,null,{"$f":"IF(G103=\"\",\"\",CEILING('Cálc. Sist. Extinção Automática'!AU15*1.25,100/'Cálc. Sist. Extinção Automática'!BK10))","v":""},0.1,0.2,0.3,0.4,0.5,0.6,0.7,0.8,0.9,1]
[null,null,"Caudal máximo","Qmáx.",{"$f":"D16","v":"l/min"},{"$f":"IF(D17=\"\",\"\",IF($B$40=\"x\",0,ROUND(D17,$E103)))","v":""},{"$f":"IF(G103=\"\",\"\",0)","v":""},{"$f":"IF($B$40=\"x\",0,IF($G$105=\"\",\"\",ROUND(H105*$G$105,$E$103)))","v":""},{"$f":"IF($B$40=\"x\",0,IF($G$105=\"\",\"\",ROUND(I105*$G$105,$E$103)))","v":""},"","","","","","","",""]
[null,null,"Pressão total","Ptotal",{"$f":"C16","v":"kPa"},{"$f":"IF(D17=\"\",\"\",IF($B$40=\"x\",0,ROUND($E$17+$F$17*F106^1.85,$D103)))","v":""},{"$f":"IF($E$17=\"\",\"\",IF($B$40=\"x\",0,ROUND($E$17+$F$17*G106^1.85,$D103)))","v":""},{"$f":"IF($E$17=\"\",\"\",IF($B$40=\"x\",0,ROUND($E$17+$F$17*H106^1.85,$D103)))","v":""},{"$f":"IF($E$17=\"\",\"\",IF($B$40=\"x\",0,ROUND($E$17+$F$17*I106^1.85,$D103)))","v":""},{"$f":"IF($E$17=\"\",\"\",IF($B$40=\"x\",0,ROUND($E$17+$F$17*J106^1.85,$D103)))","v":""},"","","","","","",""]
[]
[null,null,"Curva prevista da fonte de pressão",null,null,null,null,null,null,"Recta de aproximação da 2ª parte da curva da bomba:"]
[null,null,{"$f":"\"Pressão total - P total (\"&E107&\")\"","v":"Pressão total - P total (kPa)"},"Qmáx.",{"$f":"D16","v":"l/min"},{"$f":"IF($B$42=\"x\",0,D17)","v":""},{"$f":"IF(G103=\"\",\"\",IF($B$42=\"x\",0,0))","v":""},{"$f":"IF(D17=\"\",\"\",IF($B$42=\"x\",0,F110/2))","v":""},{"$f":"IF(D17=\"\",\"\",IF($B$42=\"x\",0,1.4*F110))","v":""},"declive (m):",{"$f":"IF(D17=\"\",\"\",($I$111-$F$111)/($I$110-$F$110))","v":""}]
[null,null,{"$f":"\"Caudal máximo - Q máx. (\"&E107&\")\"","v":"Caudal máximo - Q máx. (kPa)"},"Ptotal",{"$f":"E107","v":"kPa"},{"$f":"IF($B$42=\"x\",0,C17)","v":""},{"$f":"IF(D17=\"\",\"\",IF($B$42=\"x\",0,1.15*$C$17))","v":""},{"$f":"IF(D17=\"\",\"\",IF($B$42=\"x\",0,1.1*$C$17))","v":""},{"$f":"IF(D17=\"\",\"\",IF($B$42=\"x\",0,0.8*$C$17))","v":""},"constante:",{"$f":"IF(D17=\"\",\"\",$K$110*(-$I$110)+$I$111)","v":""}]
[null,null,"Limites da curva da fonte pressão","Qmáx.",{"$f":"E110","v":"l/min"},"L.Superior",{"$f":"IF(G103=\"\",\"\",IF($B$43=\"x\",0,0))","v":""},{"$f":"IF($B$43=\"x\",0,D17)","v":""},{"$f":"IF(D17=\"\",\"\",IF($B$43=\"x\",0,1.4*D17))","v":""},"P = mQ + constante"]
[null,null,null,"Ptotal",{"$f":"E111","v":"kPa"},null,{"$f":"IF(D17=\"\",\"\",IF($B$43=\"x\",0,1.4*$C$17))","v":""},{"$f":"IF(D17=\"\",\"\",IF($B$43=\"x\",0,1.1*$C$17))","v":""},{"$f":"IF(D17=\"\",\"\",IF($B$43=\"x\",0,0.9*$C$17))","v":""},"Estimativa do ponto de Intersecção da curva menos crítica e a curva da bomba (iterações):"]
[null,null,null,"Qmáx.",{"$f":"E112","v":"l/min"},"L.Inferior",{"$f":"G112","v":""},{"$f":"H112","v":""},{"$f":"I112","v":""},"Raiz 1:",{"$f":"IF($D$17=\"\",\"\",ROUND((-K110+(K110^2-4*F28*(-K111+E28))^(1/1.85))/(2*F28),$E$129))","v":""},{"$f":"$E$110","v":"l/min"},"Verif.1",{"$f":"IF($D$17=\"\",\"\",ROUND(K116*$K$110+$K$111,$D$129))","v":""},{"$f":"$E$111","v":"kPa"},"Verif.3",{"$f":"IF($D$17=\"\",\"\",ROUND(N117*$K$110+$K$111,$D$129))","v":""},{"$f":"$E$111","v":"kPa"},"Verif.5",{"$f":"IF($D$17=\"\",\"\",ROUND(Q117*$K$110+$K$111,$D$129))","v":""},{"$f":"$E$111","v":"kPa"}]
[null,null,null,"Ptotal",{"$f":"E113","v":"kPa"},null,{"$f":"IF($B$43=\"x\",0,$C$17)","v":""},{"$f":"IF($B$43=\"x\",0,$C$17)","v":""},{"$f":"IF($B$43=\"x\",0,IF($C$17=\"\",\"\",0.7*$C$17))","v":""},"Raiz 2:",{"$f":"IF($D$17=\"\",\"\",ROUND((-K110-(K110^2-4*F28*(-K111+E28))^(1/1.85))/(2*F28),$E$129))","v":""},{"$f":"$E$110","v":"l/min"},"Verif.2",{"$f":"IF($D$17=\"\",\"\",ROUND($E$28+$F$28*K116^1.85,$D$129))","v":""},{"$f":"$E$111","v":"kPa"},"Verif.4",{"$f":"IF($D$17=\"\",\"\",ROUND($E$28+$F$28*N117^1.85,$D$129))","v":""},{"$f":"$E$111","v":"kPa"},"Verif.6",{"$f":"IF($D$17=\"\",\"\",ROUND($E$28+$F$28*Q117^1.85,$D$129))","v":""},{"$f":"$E$111","v":"kPa"}]
[null,null,null,null,null,null,null,null,null,null,{"$f":"MAX(K114:K115)","v":0},{"$f":"$E$110","v":"l/min"},"Média",{"$f":"IF(D17=\"\",\"\",ROUND((N114+N115)/2,$D$129))","v":""},{"$f":"$E$111","v":"kPa"},"Média",{"$f":"IF($D$17=\"\",\"\",ROUND((Q114+Q115)/2,$D$129))","v":""},{"$f":"$E$111","v":"kPa"},null,{"$f":"IF($D$17=\"\",\"\",ROUND((T114+T115)/2,$D$129))","v":""},{"$f":"$E$111","v":"kPa"}]
[null,null,"Apenas 1 sprinkler crítico em func. (posição teórica)",null,null,null,null,null,null,null,null,null,null,{"$f":"IF($D$17=\"\",\"\",((N116-$E$28)/$F$28)^(1/1.85))","v":""},{"$f":"$E$110","v":"l/min"},null,{"$f":"IF($D$17=\"\",\"\",((Q116-$E$28)/$F$28)^(1/1.85))","v":""},{"$f":"$E$110","v":"l/min"},null,{"$f":"IF($D$17=\"\",\"\",((T116-$E$28)/$F$28)^(1/1.85))","v":""},{"$f":"$E$110","v":"l/min"}]
[null,null,null,"Critérios arredondamento",null,null,null,null,null,null,null,null,"Verif.7",{"$f":"IF($D$17=\"\",\"\",ROUND(T117*$K$110+$K$111,$D$129))","v":""},{"$f":"$E$111","v":"kPa"},"Verif.9",{"$f":"IF($D$17=\"\",\"\",ROUND(N121*$K$110+$K$111,$D$129))","v":""},{"$f":"$E$111","v":"kPa"},"Verif.11",{"$f":"IF($D$17=\"\",\"\",ROUND(Q121*$K$110+$K$111,$D$129))","v":""},{"$f":"$E$111","v":"kPa"}]
[null,null,null,"Pressão","Caudal",null,null,null,null,null,null,null,"Verif.8",{"$f":"IF($D$17=\"\",\"\",ROUND($E$28+$F$28*T117^1.85,$D$129))","v":""},{"$f":"$E$111","v":"kPa"},"Verif.10",{"$f":"IF($D$17=\"\",\"\",ROUND($E$28+$F$28*N121^1.85,$D$129))","v":""},{"$f":"$E$111","v":"kPa"},"Verif.12",{"$f":"IF($D$17=\"\",\"\",ROUND($E$28+$F$28*Q121^1.85,$D$129))","v":""},{"$f":"$E$111","v":"kPa"}]
[null,null,"Curva da instalação crítica 1 BI",{"$f":"D103","v":0.1},{"$f":"E103","v":0.1},"Qmáx.",{"$f":"IF(D17=\"\",\"\",IF($B$40=\"x\",0,ROUND(D22,E120)))","v":""},{"$f":"G120&\" \"&'Cálc. Sist. Extinção Automática'!$BG$4","v":" l/min"},null,null,null,null,"Média",{"$f":"IF($D$17=\"\",\"\",ROUND((N118+N119)/2,$D$129))","v":""},{"$f":"$E$111","v":"kPa"},"Média",{"$f":"IF($D$17=\"\",\"\",ROUND((Q118+Q119)/2,$D$129))","v":""},{"$f":"$E$111","v":"kPa"},"Média",{"$f":"IFERROR(IF($D$17=\"\",\"\",ROUND((T118+T119)/2,$D$129)),\"\")","v":""},{"$f":"$E$111","v":"kPa"}]
[null,null,null,{"$f":"D104","v":1},{"$f":"E104","v":1},"Ptotal",{"$f":"IF(D17=\"\",\"\",IF($B$40=\"x\",0,ROUND($E$22+$F$22*D22^1.85,D120)))","v":""},{"$f":"G121&\" \"&'Cálc. Sist. Extinção Automática'!$BL$4","v":" kPa"},null,null,null,null,null,{"$f":"IF($D$17=\"\",\"\",((N120-$E$28)/$F$28)^(1/1.85))","v":""},{"$f":"$E$110","v":"l/min"},null,{"$f":"IF($D$17=\"\",\"\",((Q120-$E$28)/$F$28)^(1/1.85))","v":""},{"$f":"$E$110","v":"l/min"},null,{"$f":"IFERROR(IF($D$17=\"\",\"\",((T120-$E$28)/$F$28)^(1/1.85)),\"\")","v":""},{"$f":"$E$110","v":"l/min"}]
[null,null,null,null,null,null,{"$f":"IF(G103=\"\",\"\",'Cálc. Sist. Extinção Automática'!$AU$6)","v":""},null,null,null,null,null,null,null,null,null,null,null,"Valor final:"]
[null,null,"Caudal máximo","Qmáx.",{"$f":"E106","v":"l/min"},{"$f":"IF(D17=\"\",\"\",IF($B$40=\"x\",0,ROUND(D22,$E120)))","v":""},{"$f":"IF(G120=\"\",\"\",0)","v":""},{"$f":"IF($B$40=\"x\",0,IF($G$122=\"\",\"\",ROUND(1.3*H106/$G$122,$E$103)))","v":""},{"$f":"IF($B$40=\"x\",0,IF($G$122=\"\",\"\",ROUND(1.3*I106/$G$122,$E$103)))","v":""},"","","","","","","","",null,"Ptotal",{"$f":"IF($B$41=\"x\",0,IF(T120=\"\",\"\",ROUND(T120,D120)))","v":""},{"$f":"$E$111","v":"kPa"}]
[null,null,"Pressão total","Ptotal",{"$f":"E107","v":"kPa"},{"$f":"IF(D17=\"\",\"\",IF($B$40=\"x\",0,ROUND($E$22+$F$22*F123^1.85,$D120)))","v":""},{"$f":"IF($D$17=\"\",\"\",IF($B$40=\"x\",0,ROUND($E$22+$F$22*G123^1.85,$D120)))","v":""},{"$f":"IF($D$17=\"\",\"\",IF($B$40=\"x\",0,ROUND($E$22+$F$22*H123^1.85,$D120)))","v":""},{"$f":"IF($D$17=\"\",\"\",IF($B$40=\"x\",0,ROUND($E$22+$F$22*I123^1.85,$D120)))","v":""},{"$f":"IF($D$17=\"\",\"\",IF($B$40=\"x\",0,ROUND($E$22+$F$22*J123^1.85,$D120)))","v":""},"","","","","","","",null,"Qmáx.",{"$f":"IF($B$41=\"x\",0,IF(T121=\"\",\"\",ROUND(T121,E120)))","v":""},{"$f":"$E$110","v":"l/min"}]
[]
[null,null,"Total de sprinklers menos críticas em funcionamento simultâneo (posição teórica)"]
[null,null,null,"Critérios arredondamento"]
[null,null,null,"Pressão","Caudal"]
[null,null,"Curvas da instalação mais críticas em caudal",{"$f":"D120","v":0.1},{"$f":"E120","v":0.1},"Qmáx.",{"$f":"IF(D17=\"\",\"\",IF($B$41=\"x\",0,ROUND(D28,E129)))","v":""},{"$f":"G129&\" \"&'Cálc. Sist. Extinção Automática'!$BG$4","v":" l/min"}]
[null,null,null,{"$f":"D121","v":1},{"$f":"E121","v":1},"Ptotal",{"$f":"IF(D17=\"\",\"\",IF($B$41=\"x\",0,ROUND($E$28+$F$28*D28^1.85,D129)))","v":""},{"$f":"G130&\" \"&'Cálc. Sist. Extinção Automática'!$BL$4","v":" kPa"}]
[null,null,null,{"$f":"IF(OR(E17=\"\",E28=\"\"),\"\",E17/E28)","v":""},{"$f":"IF(AND(D131>=0.9,D131<2),1.1,IF(AND(D131>=2,D131<4),1.15,IF(AND(D131>=4,D131<6),1.2,IF(AND(D131>=6,D131<8),1.25,IF(AND(D131>=8,D131<10),1.3,1.4)))))","v":1.4},null,{"$f":"IF(G103=\"\",\"\",CEILING('Cálc. Sist. Extinção Automática'!AU15*1.25*E131,100/'Cálc. Sist. Extinção Automática'!BK10))","v":""},0.1,0.2,0.3,0.4,0.5,0.6,0.7,0.8,0.9,1]
[null,null,"Caudal máximo","Qmáx.",{"$f":"E123","v":"l/min"},{"$f":"IF(D17=\"\",\"\",IF($B$41=\"x\",0,ROUND(D28,$E129)))","v":""},{"$f":"IF(G129=\"\",\"\",0)","v":""},{"$f":"IF(OR($B$41=\"x\",$C$24=\"\"),\"\",ROUND(H131*$G$131,$E$129))","v":""},"","","","","","","","",""]
[null,null,"Pressão total","Ptotal",{"$f":"E124","v":"kPa"},{"$f":"IF(D17=\"\",\"\",IF($B$41=\"x\",0,ROUND($E$28+$F$28*F132^1.85,$D129)))","v":""},{"$f":"IF($D$17=\"\",\"\",IF($B$41=\"x\",0,ROUND($E$28+$F$28*G132^1.85,$D129)))","v":""},"","","","","","","","","",""]
[]
[null,null,"Apenas 1 sprinkler menos crítico em funcionamento (posição teórica)"]
[null,null,null,"Critérios arredondamento"]
[null,null,null,"Pressão","Caudal"]
[null,null,"Curva da instalação mais crítica",{"$f":"D129","v":0.1},{"$f":"E129","v":0.1},"Qmáx.",{"$f":"IF(D17=\"\",\"\",IF($B$41=\"x\",0,ROUND(D33,E138)))","v":""},{"$f":"G138&\" \"&'Cálc. Sist. Extinção Automática'!$BG$4","v":" l/min"}]
[null,null,null,{"$f":"D130","v":1},{"$f":"E130","v":1},"Ptotal",{"$f":"IF(D17=\"\",\"\",IF($B$41=\"x\",0,ROUND($E$33+$F$33*D33^1.85,D138)))","v":""},{"$f":"G139&\" \"&'Cálc. Sist. Extinção Automática'!$BL$4","v":" kPa"}]
[null,null,null,null,{"$f":"E131+0.1","v":1.5},null,{"$f":"IF(G138=\"\",\"\",'Cálc. Sist. Extinção Automática'!$AU$6)","v":""}]
[null,null,"Caudal máximo","Qmáx.",{"$f":"E132","v":"l/min"},{"$f":"IF(D17=\"\",\"\",IF($B$41=\"x\",0,ROUND(D33,$E138)))","v":""},{"$f":"IF(G138=\"\",\"\",0)","v":""},{"$f":"IF(OR($B$41=\"x\",$C$24=\"\"),\"\",ROUND($E$140*H132/$G$140,$E$103))","v":""},"","","","","","","","",""]
[null,null,"Pressão total","Ptotal",{"$f":"E133","v":"kPa"},{"$f":"IF(D17=\"\",\"\",IF($B$41=\"x\",0,ROUND($E$33+$F$33*F141^1.85,$D138)))","v":""},{"$f":"IF($D$17=\"\",\"\",IF($B$41=\"x\",0,ROUND($E$33+$F$33*G141^1.85,$D138)))","v":""},"","","","","","","","","",""]

{"sheet":"Quadro 1","index":2,"n_rows":34,"n_cols":15,"rows_kept":34,"cut":false,"hidden":false,"merged":[[5,3,5,4],[6,11,6,12],[6,13,6,14],[5,11,5,14],[5,7,5,9],[6,7,6,9]]}
[]
[null,null," Dimensionamento de Sistema de Extinção Automática (Rede de Sprinklers Tipo Húmida)"]
[]
[null,null,"Quadro 1:","Gama de Tubos de Aço para Canalizações soldados longitudinalmente (W)"]
[]
[null,null,null,"Dimensão Nominal",null,null,"Diâm.","Diâmetro Exterior",null,null,"Espessura","Massa Nominal em função das extremidades: (kg / m) "]
[null,null,null,null,null,null,"Interior","D (mm)",null,null,"T (mm)","Tubo Preto",null,"Tubo Galvanizado"]
[null,null,null,"( R )","(DN)",null,"(mm)","Nominal","Máx.","Min.","Nominal","Lisos","Rosc.c/ aces. ","Lisos","Rosc.c/ aces. "]
[null,null,null,0.375,"DN   10",null,12.6,17.2,17.5,16.7,2.2999999999999998,0.83899999999999997,0.84499999999999997,0.89500000000000002,0.90100000000000002]
[null,null,null,0.5,"DN   15",null,16.100000000000001,21.3,21.8,21,2.6,1.21,1.22,1.28,1.29]
[null,null,null,0.75,"DN   20",null,21.7,26.9,27.3,26.5,2.6,1.56,1.57,1.66,1.67]
[null,null,null,1,"DN   25",null,27.3,33.700000000000003,34.200000000000003,33.299999999999997,3.2,2.41,2.4300000000000002,2.56,2.58]
[null,null,null,1.25,"DN   32",null,36,42.4,42.9,42,3.2,3.1,3.13,3.3,3.33]
[null,null,null,1.5,"DN   40",null,41.9,48.3,48.8,47.9,3.2,3.56,3.6,3.79,3.83]
[null,null,null,2,"DN   50",null,53.1,60.3,60.8,59.7,3.6,5.03,5.0999999999999996,5.36,5.43]
[null,null,null,2.5,"DN   65",null,68.900000000000006,76.099999999999994,76.599999999999994,75.3,3.6,6.42,6.54,6.84,6.96]
[null,null,null,3,"DN   80",null,80.900000000000006,88.9,89.5,88,4,8.36,8.5299999999999994,8.89,9.06]
[null,null,null,4,"DN 100",null,105.3,114.3,115,113.1,4.5,12.2,12.5,12.7,13]
[null,null,null,5,"DN 125",null,129.69999999999999,139.69999999999999,140.80000000000001,138.5,5,16.600000000000001,17.100000000000001,17.05,17.55]
[null,null,null,6,"DN 150",null,155.1,165.1,166.5,163.9,5,19.8,20.399999999999999,20.27,20.87]
[null,null,null,8,"DN 200",null,206.5,219.1,221.291,216.90899999999999,6.3,23.8]
[null,null,null,10,"DN 250",null,260.39999999999998,273,275.04750000000001,270.95249999999999,6.3,33]
[null,null,null,12,"DN 300",null,311.3,323.89999999999998,326.32925,321.47074999999995,6.3,44]
[]
[]
[]
[]
[null,null,"Tolerâncias:"]
[null,null,"Espessura ( T ):",null,"± 10 % da espessura da parede nominal."]
[null,null,"Massa ( m ): ",null,"± 7,5 % da massa nominal correspondente para atados iguais ou superiores a 10 ton. "]
[null,null,"Comprimento ( L ):",null,"- 50 mm / + 150 mm do comprimento nominal ; por acordo poderão ser estabelecidas tolerâncias mais apertadas."]
[null,null,"Galvanizado:",null,"Galvanizado: A camada de zinco do tubo de aço é aplicada por “Imersão a Quente” e possui uma massa depositada"]
[null,null,null,null,"por unidade de área do revestimento igual a 400 g/m2, correspondente a uma espessura média miníma de 56 micron. "]
[null,null,"Roscas ( R ):",null,"Conformes a norma NP EN 10226-1 ; Tubos fornecidos com comprimento normalizado = 6 m."]

{"sheet":"Quadro 2","index":3,"n_rows":77,"n_cols":93,"rows_kept":77,"cut":false,"hidden":false,"merged":[[4,22,8,22],[3,10,3,28],[3,29,3,34],[3,35,3,39],[4,10,8,10],[4,11,8,11],[4,12,8,12],[4,13,8,13],[4,14,8,14],[4,15,8,15],[4,16,8,16],[4,17,8,17],[4,18,8,18],[4,19,8,19],[4,20,8,20],[4,21,8,21],[4,34,8,34],[4,23,8,23],[4,24,8,24],[4,25,8,25],[4,26,8,26],[4,27,8,27],[4,28,8,28],[4,29,8,29],[4,30,8,30],[4,31,8,31],[4,32,8,32],[4,33,8,33],[4,49,8,49],[4,35,8,35],[4,36,8,36],[4,37,8,37],[4,38,8,38],[4,39,8,39],[4,43,8,43],[4,66,8,66],[4,67,8,67],[4,56,8,56],[4,57,8,57],[4,58,8,58],[4,59,8,59],[4,60,8,60],[4,61,8,61],[8,6,8,8],[4,62,8,62],[4,63,8,63],[4,64,8,64],[4,65,8,65],[4,50,8,50],[4,51,8,51],[4,52,8,52],[4,53,8,53],[4,54,8,54],[4,55,8,55],[4,44,8,44],[4,45,8,45],[4,46,8,46],[4,47,8,47],[4,48,8,48],[37,79,37,81],[37,82,37,84],[8,77,8,89],[9,2,9,4],[10,74,11,74],[10,75,11,75],[33,74,34,74],[33,75,34,75],[33,76,34,76],[4,68,8,68],[4,69,8,69],[4,70,8,70],[4,71,8,71],[4,72,8,72],[7,3,7,4],[8,2,8,4],[35,77,35,79],[35,81,35,83],[35,84,35,86],[36,78,36,80],[36,81,36,84],[41,82,41,85],[60,77,60,92],[69,77,69,92],[38,79,38,82],[38,83,38,85],[39,80,39,82],[39,83,39,86],[40,80,40,83],[40,84,40,87]]}
[]
[]
[]
[null,null,"Quadro 2",null,null,null,null,null,null,null,"Acessórios roscados em fundição maleável conformes NP EN 10242",null,null,null,null,null,null,null,null,null,null,null,null,null,null,null,null,null,null,"Acessórios ranhurados",null,null,null,null,null,"Válvulas"]
[null,null,"Matriz de afectação dos acessórios utilizados",null,null,null,null,null,null,null,{"$f":"AR5","v":"Curva m/f 90"},"Curva m/f curta 90","Curva fêmea 90","Curva fêmea curta 90","Curva macho 90","Curva m/f 45","Curva  fêmea 45","União de cruzamento","Joelho simples 90","Joelho m/f simples 90","Joelho simples 45","Tê simples 90","Tê de redução","Cruzeta","Joelho de 3 vias","União de redução","União simples","Junção sede plana","Junção sede cónica","União ranhurada","Uniáo de red. ranhurada","Joelho 90º ranhurado","Joelho 45º ranhurado","Tê ranhurado","Derivação roscada","Válvula de comporta","Válvula de globo","Válvula de retenção","Válvula de aspiração","Válvula de corte BI",null,null,null,{"$f":"$BX$13","v":"Curva m/f 90"},{"$f":"$BX$14","v":"Curva m/f curta 90"},{"$f":"$BX$15","v":"Curva fêmea 90"},{"$f":"$BX$16","v":"Curva fêmea curta 90"},{"$f":"$BX$17","v":"Curva macho 90"},{"$f":"$BX$18","v":"Curva m/f 45"},{"$f":"$BX$19","v":"Curva  fêmea 45"},{"$f":"$BX$20","v":"União de cruzamento"},{"$f":"$BX$21","v":"Joelho simples 90"},{"$f":"$BX$23","v":"Joelho m/f simples 90"},{"$f":"$BX$29","v":"Joelho simples 45"},{"$f":"$BX$31","v":"Tê simples 90"},{"$f":"$BX$34","v":"Tê de redução"},{"$f":"$BX$44","v":"Cruzeta"},{"$f":"$BX$46","v":"Joelho de 3 vias"},{"$f":"$BX$47","v":"União de redução"},{"$f":"$BX$51","v":"União simples"},{"$f":"$BX$55","v":"Junção sede plana"},{"$f":"$BX$57","v":"Junção sede cónica"},{"$f":"$BX$63","v":"União ranhurada"},{"$f":"$BX$64","v":"Uniáo de red. ranhurada"},{"$f":"$BX$65","v":"Joelho 90º ranhurado"},{"$f":"$BX$66","v":"Joelho 45º ranhurado"},{"$f":"$BX$67","v":"Tê ranhurado"},{"$f":"$BX$69","v":"Derivação roscada"},{"$f":"$BX$72","v":"Válvula de comporta"},{"$f":"$BX$73","v":"Válvula de globo"},{"$f":"$BX$74","v":"Válvula de retenção"},{"$f":"$BX$76","v":"Válvula de aspiração"},{"$f":"$BX$77","v":"Válvula de corte BI"}]
[null,null,"(cálculo do comprimento equivalente)"]
[null,null,1,2,3,16,7,7,7]
[null,null,null,{"$f":"'Cálc. Sist. Extinção Automática'!F20","v":"0.2"},null,"Quadro 1","3.3","3.3a","3.3b",null,null,null,null,null,null,null,null,null,null,null,null,null,null,null,null,null,null,null,null,null,null,null,null,null,null,null,null,null,null,null,null,null,null,null,null,null,null,null,null,null,null,null,null,null,null,null,null,null,null,null,null,null,null,null,null,null,null,null,null,null,null,null,null,null,"Quadro 2:","Comprimentos Equivalentes (em \"metros\") - Acessórios Roscados em ferro fundido maleável, conformes EN 10242."]
[null,null,"Codificação",null,null,"Troço","Comprimentos Equivalentes",null,null,null,null,null,null,null,null,null,null,null,null,null,null,null,null,null,null,null,null,null,null,null,null,null,null,null,null,null,null,null,null,null,null,null,null,null,null,null,null,null,null,null,null,null,null,null,null,null,null,null,null,null,null,null,null,null,null,null,null,null,null,null,null,null,null,null,"Comprimentos Equivalentes ( Leq ) - metros",null,null,"Dimensão do Acessório Roscado em ferro fundido maleável conforme EN 10242"]
[null,null,"dos troços",null,null,"dimensão","local","adicional","Parcial",null,{"$f":"K11","v":0},{"$f":"L11","v":0},0,0,0,0,0,0,0,0,0,0,0,0,0,0,0,0,0,0,0,0,0,0,0,0,0,0,0,0,null,null,null,null,null,null,null,null,null,null,null,null,null,null,null,null,null,null,null,null,null,null,null,null,null,null,null,null,null,null,null,null,null,null,null,null,null,1,2,3,4,5,6,7,8,9,10,11,12,13,14,15,16]
[null,null,"N","Início","Fim","R / NPS","Leq. local","Leq. adic.","Leq. parc.",null,{"$f":"AR11","v":0},{"$f":"AS11","v":0},0,0,0,0,0,0,0,0,0,0,0,0,0,0,0,0,0,0,0,0,0,0,0,0,0,0,0,0,null,null,null,{"$f":"COUNTIF(AR13:AR37,0)","v":0},{"$f":"COUNTIF(AS13:AS37,0)","v":0},0,0,0,0,0,0,0,0,0,0,0,0,0,0,0,0,0,0,0,0,0,0,0,0,0,0,0,0,null,"Figura","Designação / Imagem","Dim. Rosca:",0.25,0.375,0.5,0.75,1,1.25,1.5,2,2.5,3,4,5,6,8,10,12]
[null,null,"n.º",null,null,null,"m","m","m",null,{"$f":"AR12","v":1},"1a",2,"2a",3,40,41,85,90,92,120,130,"130R",180,221,240,270,330,340,"RN","FR",90,120,130,"DA1",600,172,640,196,"BI",null,null,null,{"$f":"$BW$13","v":1},{"$f":"$BW$14","v":"1a"},{"$f":"$BW$15","v":2},{"$f":"$BW$16","v":"2a"},{"$f":"$BW$17","v":3},{"$f":"$BW$18","v":40},{"$f":"$BW$19","v":41},{"$f":"$BW$20","v":85},{"$f":"$BW$21","v":90},{"$f":"$BW$23","v":92},{"$f":"$BW$29","v":120},{"$f":"$BW$31","v":130},{"$f":"$BW$34","v":"130R"},{"$f":"$BW$44","v":180},{"$f":"$BW$46","v":221},{"$f":"$BW$47","v":240},{"$f":"$BW$51","v":270},{"$f":"$BW$55","v":330},{"$f":"$BW$57","v":340},{"$f":"$BW$63","v":"RN"},{"$f":"$BW$64","v":"FR"},{"$f":"$BW$65","v":90},{"$f":"$BW$66","v":120},{"$f":"$BW$67","v":130},{"$f":"$BW$69","v":"DA1"},{"$f":"$BW$72","v":600},{"$f":"$BW$73","v":172},{"$f":"$BW$74","v":640},{"$f":"$BW$76","v":196},{"$f":"$BW$77","v":"BI"},null,null,null,"Dim. Nominal:","DN 8","DN 10","DN 15","DN 20","DN 25","DN 32","DN 40","DN 50","DN 65","DN 80","DN 100","DN 125","DN 150","DN 200","DN 250","DN 300"]
[null,null,{"$f":"'Cálc. Sist. Extinção Automática'!E25","v":""},{"$f":"IF('Cálc. Sist. Extinção Automática'!F25=\"\",\"\",'Cálc. Sist. Extinção Automática'!F25)","v":""},{"$f":"IF('Cálc. Sist. Extinção Automática'!G25=\"\",\"\",'Cálc. Sist. Extinção Automática'!G25)","v":""},{"$f":"IF('Cálc. Sist. Extinção Automática'!AA25=\"\",\"\",'Cálc. Sist. Extinção Automática'!AA25)","v":""},{"$f":"IF(F13=\"\",\"\",IF(ABS(H13)+I13=0,\"\",ABS(H13)+I13))","v":""},null,{"$f":"IF(F13=\"\",\"\",SUM(AR13:BU13))","v":""},null,null,null,null,null,null,null,null,null,null,null,null,null,null,null,null,null,null,null,null,null,null,null,null,null,null,null,null,null,null,null,null,null,null,{"$f":"IF(OR($F13=\"\",K13=\"\"),\"\",IF(K13=\"x\",LOOKUP(MATCH($F13,$BZ$11:$CO$11,0),$BZ$10:$CO$10,$BZ$13:$CO$13),K13*LOOKUP(MATCH($F13,$BZ$11:$CO$11,0),$BZ$10:$CO$10,$BZ$13:$CO$13)))","v":""},{"$f":"IF(OR($F13=\"\",L13=\"\"),\"\",IF(L13=\"x\",LOOKUP(MATCH($F13,$BZ$11:$CO$11,0),$BZ$10:$CO$10,$BZ$14:$CO$14),L13*LOOKUP(MATCH($F13,$BZ$11:$CO$11,0),$BZ$10:$CO$10,$BZ$14:$CO$14)))","v":""},{"$f":"IF(OR($F13=\"\",M13=\"\"),\"\",IF(M13=\"x\",LOOKUP(MATCH($F13,$BZ$11:$CO$11,0),$BZ$10:$CO$10,$BZ$15:$CO$15),M13*LOOKUP(MATCH($F13,$BZ$11:$CO$11,0),$BZ$10:$CO$10,$BZ$15:$CO$15)))","v":""},{"$f":"IF(OR($F13=\"\",N13=\"\"),\"\",IF(N13=\"x\",LOOKUP(MATCH($F13,$BZ$11:$CO$11,0),$BZ$10:$CO$10,$BZ$16:$CO$16),N13*LOOKUP(MATCH($F13,$BZ$11:$CO$11,0),$BZ$10:$CO$10,$BZ$16:$CO$16)))","v":""},{"$f":"IF(OR($F13=\"\",O13=\"\"),\"\",IF(O13=\"x\",LOOKUP(MATCH($F13,$BZ$11:$CO$11,0),$BZ$10:$CO$10,$BZ$17:$CO$17),O13*LOOKUP(MATCH($F13,$BZ$11:$CO$11,0),$BZ$10:$CO$10,$BZ$17:$CO$17)))","v":""},{"$f":"IF(OR($F13=\"\",P13=\"\"),\"\",IF(P13=\"x\",LOOKUP(MATCH($F13,$BZ$11:$CO$11,0),$BZ$10:$CO$10,$BZ$18:$CO$18),P13*LOOKUP(MATCH($F13,$BZ$11:$CO$11,0),$BZ$10:$CO$10,$BZ$18:$CO$18)))","v":""},{"$f":"IF(OR($F13=\"\",Q13=\"\"),\"\",IF(Q13=\"x\",LOOKUP(MATCH($F13,$BZ$11:$CO$11,0),$BZ$10:$CO$10,$BZ$19:$CO$19),Q13*LOOKUP(MATCH($F13,$BZ$11:$CO$11,0),$BZ$10:$CO$10,$BZ$19:$CO$19)))","v":""},{"$f":"IF(OR($F13=\"\",R13=\"\"),\"\",IF(R13=\"x\",LOOKUP(MATCH($F13,$BZ$11:$CO$11,0),$BZ$10:$CO$10,$BZ$20:$CO$20),R13*LOOKUP(MATCH($F13,$BZ$11:$CO$11,0),$BZ$10:$CO$10,$BZ$20:$CO$20)))","v":""},{"$f":"IF(OR($F13=\"\",S13=\"\"),\"\",IF(S13=\"x\",LOOKUP(MATCH($F13,$BZ$11:$CO$11,0),$BZ$10:$CO$10,$BZ$21:$CO$21),S13*LOOKUP(MATCH($F13,$BZ$11:$CO$11,0),$BZ$10:$CO$10,$BZ$21:$CO$21)))","v":""},{"$f":"IF(OR($F13=\"\",T13=\"\"),\"\",IF(T13=\"x\",LOOKUP(MATCH($F13,$BZ$11:$CO$11,0),$BZ$10:$CO$10,$BZ$23:$CO$23),T13*LOOKUP(MATCH($F13,$BZ$11:$CO$11,0),$BZ$10:$CO$10,$BZ$23:$CO$23)))","v":""},{"$f":"IF(OR($F13=\"\",U13=\"\"),\"\",IF(U13=\"x\",LOOKUP(MATCH($F13,$BZ$11:$CO$11,0),$BZ$10:$CO$10,$BZ$29:$CO$29),U13*LOOKUP(MATCH($F13,$BZ$11:$CO$11,0),$BZ$10:$CO$10,$BZ$29:$CO$29)))","v":""},{"$f":"IF(OR($F13=\"\",V13=\"\"),\"\",IF(V13=\"x\",LOOKUP(MATCH($F13,$BZ$11:$CO$11,0),$BZ$10:$CO$10,$BZ$31:$CO$31),V13*LOOKUP(MATCH($F13,$BZ$11:$CO$11,0),$BZ$10:$CO$10,$BZ$31:$CO$31)))","v":""},{"$f":"IF(OR($F13=\"\",W13=\"\"),\"\",IF(W13=\"x\",LOOKUP(MATCH($F13,$BZ$11:$CO$11,0),$BZ$10:$CO$10,$BZ$34:$CO$34),W13*LOOKUP(MATCH($F13,$BZ$11:$CO$11,0),$BZ$10:$CO$10,$BZ$34:$CO$34)))","v":""},{"$f":"IF(OR($F13=\"\",X13=\"\"),\"\",IF(X13=\"x\",LOOKUP(MATCH($F13,$BZ$11:$CO$11,0),$BZ$10:$CO$10,$BZ$44:$CO$44),X13*LOOKUP(MATCH($F13,$BZ$11:$CO$11,0),$BZ$10:$CO$10,$BZ$44:$CO$44)))","v":""},{"$f":"IF(OR($F13=\"\",Y13=\"\"),\"\",IF(Y13=\"x\",LOOKUP(MATCH($F13,$BZ$11:$CO$11,0),$BZ$10:$CO$10,$BZ$46:$CO$46),Y13*LOOKUP(MATCH($F13,$BZ$11:$CO$11,0),$BZ$10:$CO$10,$BZ$46:$CO$46)))","v":""},{"$f":"IF(OR($F13=\"\",Z13=\"\"),\"\",IF(Z13=\"x\",LOOKUP(MATCH($F13,$BZ$11:$CO$11,0),$BZ$10:$CO$10,$BZ$47:$CO$47),Z13*LOOKUP(MATCH($F13,$BZ$11:$CO$11,0),$BZ$10:$CO$10,$BZ$47:$CO$47)))","v":""},{"$f":"IF(OR($F13=\"\",AA13=\"\"),\"\",IF(AA13=\"x\",LOOKUP(MATCH($F13,$BZ$11:$CO$11,0),$BZ$10:$CO$10,$BZ$51:$CO$51),AA13*LOOKUP(MATCH($F13,$BZ$11:$CO$11,0),$BZ$10:$CO$10,$BZ$51:$CO$51)))","v":""},{"$f":"IF(OR($F13=\"\",AB13=\"\"),\"\",IF(AB13=\"x\",LOOKUP(MATCH($F13,$BZ$11:$CO$11,0),$BZ$10:$CO$10,$BZ$55:$CO$55),AB13*LOOKUP(MATCH($F13,$BZ$11:$CO$11,0),$BZ$10:$CO$10,$BZ$55:$CO$55)))","v":""},{"$f":"IF(OR($F13=\"\",AC13=\"\"),\"\",IF(AC13=\"x\",LOOKUP(MATCH($F13,$BZ$11:$CO$11,0),$BZ$10:$CO$10,$BZ$57:$CO$57),AC13*LOOKUP(MATCH($F13,$BZ$11:$CO$11,0),$BZ$10:$CO$10,$BZ$57:$CO$57)))","v":""},{"$f":"IF(OR($F13=\"\",AD13=\"\"),\"\",IF(AD13=\"x\",LOOKUP(MATCH($F13,$BZ$11:$CO$11,0),$BZ$10:$CO$10,$BZ$63:$CO$63),AD13*LOOKUP(MATCH($F13,$BZ$11:$CO$11,0),$BZ$10:$CO$10,$BZ$63:$CO$63)))","v":""},{"$f":"IF(OR($F13=\"\",AE13=\"\"),\"\",IF(AE13=\"x\",LOOKUP(MATCH($F13,$BZ$11:$CO$11,0),$BZ$10:$CO$10,$BZ$64:$CO$64),AE13*LOOKUP(MATCH($F13,$BZ$11:$CO$11,0),$BZ$10:$CO$10,$BZ$64:$CO$64)))","v":""},{"$f":"IF(OR($F13=\"\",AF13=\"\"),\"\",IF(AF13=\"x\",LOOKUP(MATCH($F13,$BZ$11:$CO$11,0),$BZ$10:$CO$10,$BZ$65:$CO$65),AF13*LOOKUP(MATCH($F13,$BZ$11:$CO$11,0),$BZ$10:$CO$10,$BZ$65:$CO$65)))","v":""},{"$f":"IF(OR($F13=\"\",AG13=\"\"),\"\",IF(AG13=\"x\",LOOKUP(MATCH($F13,$BZ$11:$CO$11,0),$BZ$10:$CO$10,$BZ$66:$CO$66),AG13*LOOKUP(MATCH($F13,$BZ$11:$CO$11,0),$BZ$10:$CO$10,$BZ$66:$CO$66)))","v":""},{"$f":"IF(OR($F13=\"\",AH13=\"\"),\"\",IF(AH13=\"x\",LOOKUP(MATCH($F13,$BZ$11:$CO$11,0),$BZ$10:$CO$10,$BZ$67:$CO$67),AH13*LOOKUP(MATCH($F13,$BZ$11:$CO$11,0),$BZ$10:$CO$10,$BZ$67:$CO$67)))","v":""},{"$f":"IF(OR($F13=\"\",AI13=\"\"),\"\",IF(AI13=\"x\",LOOKUP(MATCH($F13,$BZ$11:$CO$11,0),$BZ$10:$CO$10,$BZ$69:$CO$69),AI13*LOOKUP(MATCH($F13,$BZ$11:$CO$11,0),$BZ$10:$CO$10,$BZ$69:$CO$69)))","v":""},{"$f":"IF(OR($F13=\"\",AJ13=\"\"),\"\",IF(AJ13=\"x\",LOOKUP(MATCH($F13,$BZ$11:$CO$11,0),$BZ$10:$CO$10,$BZ$72:$CO$72),AJ13*LOOKUP(MATCH($F13,$BZ$11:$CO$11,0),$BZ$10:$CO$10,$BZ$72:$CO$72)))","v":""},{"$f":"IF(OR($F13=\"\",AK13=\"\"),\"\",IF(AK13=\"x\",LOOKUP(MATCH($F13,$BZ$11:$CO$11,0),$BZ$10:$CO$10,$BZ$73:$CO$73),AK13*LOOKUP(MATCH($F13,$BZ$11:$CO$11,0),$BZ$10:$CO$10,$BZ$73:$CO$73)))","v":""},{"$f":"IF(OR($F13=\"\",AL13=\"\"),\"\",IF(AL13=\"x\",LOOKUP(MATCH($F13,$BZ$11:$CO$11,0),$BZ$10:$CO$10,$BZ$74:$CO$74),AL13*LOOKUP(MATCH($F13,$BZ$11:$CO$11,0),$BZ$10:$CO$10,$BZ$74:$CO$74)))","v":""},{"$f":"IF(OR($F13=\"\",AM13=\"\"),\"\",IF(AM13=\"x\",LOOKUP(MATCH($F13,$BZ$11:$CO$11,0),$BZ$10:$CO$10,$BZ$76:$CO$76),AM13*LOOKUP(MATCH($F13,$BZ$11:$CO$11,0),$BZ$10:$CO$10,$BZ$76:$CO$76)))","v":""},{"$f":"IF(OR($F13=\"\",AN13=\"\"),\"\",IF(AN13=\"x\",LOOKUP(MATCH($F13,$BZ$11:$CO$11,0),$BZ$10:$CO$10,$BZ$77:$CO$77),AN13*LOOKUP(MATCH($F13,$BZ$11:$CO$11,0),$BZ$10:$CO$10,$BZ$77:$CO$77)))","v":""},null,1,"Curva m/f 90",null,0,0.18,0.3,0.4,0.5,0.7,0.9,1.1000000000000001,1.3,1.6,2.1,2.7,3.4,0,0,0]
[null,null,{"$f":"'Cálc. Sist. Extinção Automática'!E26","v":""},{"$f":"IF('Cálc. Sist. Extinção Automática'!F26=\"\",\"\",'Cálc. Sist. Extinção Automática'!F26)","v":""},{"$f":"IF('Cálc. Sist. Extinção Automática'!G26=\"\",\"\",'Cálc. Sist. Extinção Automática'!G26)","v":""},{"$f":"IF('Cálc. Sist. Extinção Automática'!AA26=\"\",\"\",'Cálc. Sist. Extinção Automática'!AA26)","v":""},{"$f":"IF(F14=\"\",\"\",IF(ABS(H14)+I14=0,\"\",ABS(H14)+I14))","v":""},null,{"$f":"IF(F14=\"\",\"\",SUM(AR14:BU14))","v":""},null,null,null,null,null,null,null,null,null,null,null,null,null,null,null,null,null,null,null,null,null,null,null,null,null,null,null,null,null,null,null,null,null,null,"","","","","","","","","","","","","","","","","","","","","","","","","","","","","","",null,"1a","Curva m/f curta 90",null,0.16,0.24,0.32,0.48,0.64,0.79,0.95,1.27,1.59,1.91,2.54,0,0,0,0,0]
[null,null,{"$f":"'Cálc. Sist. Extinção Automática'!E27","v":""},{"$f":"IF('Cálc. Sist. Extinção Automática'!F27=\"\",\"\",'Cálc. Sist. Extinção Automática'!F27)","v":""},{"$f":"IF('Cálc. Sist. Extinção Automática'!G27=\"\",\"\",'Cálc. Sist. Extinção Automática'!G27)","v":""},{"$f":"IF('Cálc. Sist. Extinção Automática'!AA27=\"\",\"\",'Cálc. Sist. Extinção Automática'!AA27)","v":""},{"$f":"IF(F15=\"\",\"\",IF(ABS(H15)+I15=0,\"\",ABS(H15)+I15))","v":""},null,"",null,null,null,null,null,null,null,null,null,null,null,null,null,null,null,null,null,null,null,null,null,null,null,null,null,null,null,null,null,null,null,null,null,null,"","","","","","","","","","","","","","","","","","","","","","","","","","","","","","",null,2,"Curva fêmea 90",null,0,0.18,0.3,0.4,0.5,0.7,0.9,1.1000000000000001,1.3,1.6,2.1,2.7,3.4,0,0,0]
[null,null,{"$f":"'Cálc. Sist. Extinção Automática'!E28","v":""},{"$f":"IF('Cálc. Sist. Extinção Automática'!F28=\"\",\"\",'Cálc. Sist. Extinção Automática'!F28)","v":""},{"$f":"IF('Cálc. Sist. Extinção Automática'!G28=\"\",\"\",'Cálc. Sist. Extinção Automática'!G28)","v":""},{"$f":"IF('Cálc. Sist. Extinção Automática'!AA28=\"\",\"\",'Cálc. Sist. Extinção Automática'!AA28)","v":""},"",null,"",null,null,null,null,null,null,null,null,null,null,null,null,null,null,null,null,null,null,null,null,null,null,null,null,null,null,null,null,null,null,null,null,null,null,"","","","","","","","","","","","","","","","","","","","","","","","","","","","","","",null,"2a","Curva fêmea curta 90",null,0,null,0.4,0.6,0.7,0.9,1.1000000000000001,1.4,1.7,2.1,2.8,3.7,4.3,0,0,0]
[null,null,{"$f":"'Cálc. Sist. Extinção Automática'!E29","v":""},{"$f":"IF('Cálc. Sist. Extinção Automática'!F29=\"\",\"\",'Cálc. Sist. Extinção Automática'!F29)","v":""},{"$f":"IF('Cálc. Sist. Extinção Automática'!G29=\"\",\"\",'Cálc. Sist. Extinção Automática'!G29)","v":""},{"$f":"IF('Cálc. Sist. Extinção Automática'!AA29=\"\",\"\",'Cálc. Sist. Extinção Automática'!AA29)","v":""},"",null,"",null,null,null,null,null,null,null,null,null,null,null,null,null,null,null,null,null,null,null,null,null,null,null,null,null,null,null,null,null,null,null,null,null,null,"","","","","","","","","","","","","","","","","","","","","","","","","","","","","","",null,3,"Curva macho 90",null,0,0.25,0.34,0.5,0.67,0.84,1.01,1.35,1.68,2.02,2.69,0,4.04,0,0,0]
[null,null,{"$f":"'Cálc. Sist. Extinção Automática'!E30","v":""},{"$f":"IF('Cálc. Sist. Extinção Automática'!F30=\"\",\"\",'Cálc. Sist. Extinção Automática'!F30)","v":""},{"$f":"IF('Cálc. Sist. Extinção Automática'!G30=\"\",\"\",'Cálc. Sist. Extinção Automática'!G30)","v":""},{"$f":"IF('Cálc. Sist. Extinção Automática'!AA30=\"\",\"\",'Cálc. Sist. Extinção Automática'!AA30)","v":""},"",null,"",null,null,null,null,null,null,null,null,null,null,null,null,null,null,null,null,null,null,null,null,null,null,null,null,null,null,null,null,null,null,null,null,null,null,"","","","","","","","","","","","","","","","","","","","","","","","","","","","","","",null,40,"Curva m/f 45",null,0.1,0.15,0.2,0.3,0.41,0.51,0.61,0.81,1.02,1.22,1.73,2.16,2.59,0,0,0]
[null,null,{"$f":"'Cálc. Sist. Extinção Automática'!E31","v":""},{"$f":"IF('Cálc. Sist. Extinção Automática'!F31=\"\",\"\",'Cálc. Sist. Extinção Automática'!F31)","v":""},{"$f":"IF('Cálc. Sist. Extinção Automática'!G31=\"\",\"\",'Cálc. Sist. Extinção Automática'!G31)","v":""},{"$f":"IF('Cálc. Sist. Extinção Automática'!AA31=\"\",\"\",'Cálc. Sist. Extinção Automática'!AA31)","v":""},"",null,"",null,null,null,null,null,null,null,null,null,null,null,null,null,null,null,null,null,null,null,null,null,null,null,null,null,null,null,null,null,null,null,null,null,null,"","","","","","","","","","","","","","","","","","","","","","","","","","","","","","",null,41,"Curva  fêmea 45",null,0.1,0.16,0.22,0.32,0.43,0.54,0.65,0.86,1.08,1.3,1.73,2.16,2.59,0,0,0]
[null,null,{"$f":"'Cálc. Sist. Extinção Automática'!E32","v":""},{"$f":"IF('Cálc. Sist. Extinção Automática'!F32=\"\",\"\",'Cálc. Sist. Extinção Automática'!F32)","v":""},{"$f":"IF('Cálc. Sist. Extinção Automática'!G32=\"\",\"\",'Cálc. Sist. Extinção Automática'!G32)","v":""},{"$f":"IF('Cálc. Sist. Extinção Automática'!AA32=\"\",\"\",'Cálc. Sist. Extinção Automática'!AA32)","v":""},"",null,"",null,null,null,null,null,null,null,null,null,null,null,null,null,null,null,null,null,null,null,null,null,null,null,null,null,null,null,null,null,null,null,null,null,null,"","","","","","","","","","","","","","","","","","","","","","","","","","","","","","",null,85,"União de cruzamento",null,0,0,0.87,0,0,0,0,0,0,0,0,0,0,0,0,0]
[null,null,{"$f":"'Cálc. Sist. Extinção Automática'!E33","v":""},{"$f":"IF('Cálc. Sist. Extinção Automática'!F33=\"\",\"\",'Cálc. Sist. Extinção Automática'!F33)","v":""},{"$f":"IF('Cálc. Sist. Extinção Automática'!G33=\"\",\"\",'Cálc. Sist. Extinção Automática'!G33)","v":""},{"$f":"IF('Cálc. Sist. Extinção Automática'!AA33=\"\",\"\",'Cálc. Sist. Extinção Automática'!AA33)","v":""},"",null,"",null,null,null,null,null,null,null,null,null,null,null,null,null,null,null,null,null,null,null,null,null,null,null,null,null,null,null,null,null,null,null,null,null,null,"","","","","","","","","","","","","","","","","","","","","","","","","","","","","","",null,90,"Joelho simples 90",null,0.23,0.35,0.47,0.7,0.94,1.17,1.41,1.88,2.35,2.82,3.76,4.7,5.64,0,0,0]
[null,null,{"$f":"'Cálc. Sist. Extinção Automática'!E34","v":""},{"$f":"IF('Cálc. Sist. Extinção Automática'!F34=\"\",\"\",'Cálc. Sist. Extinção Automática'!F34)","v":""},{"$f":"IF('Cálc. Sist. Extinção Automática'!G34=\"\",\"\",'Cálc. Sist. Extinção Automática'!G34)","v":""},{"$f":"IF('Cálc. Sist. Extinção Automática'!AA34=\"\",\"\",'Cálc. Sist. Extinção Automática'!AA34)","v":""},"",null,"",null,null,null,null,null,null,null,null,null,null,null,null,null,null,null,null,null,null,null,null,null,null,null,null,null,null,null,null,null,null,null,null,null,null,"","","","","","","","","","","","","","","","","","","","","","","","","","","","","","",null,"90R","Joelhos de redução 90",null,0,0,0,0,0,0,0,0,0,0,0,0,0,0,0,0]
[null,null,{"$f":"'Cálc. Sist. Extinção Automática'!E35","v":""},{"$f":"IF('Cálc. Sist. Extinção Automática'!F35=\"\",\"\",'Cálc. Sist. Extinção Automática'!F35)","v":""},{"$f":"IF('Cálc. Sist. Extinção Automática'!G35=\"\",\"\",'Cálc. Sist. Extinção Automática'!G35)","v":""},{"$f":"IF('Cálc. Sist. Extinção Automática'!AA35=\"\",\"\",'Cálc. Sist. Extinção Automática'!AA35)","v":""},"",null,"",null,null,null,null,null,null,null,null,null,null,null,null,null,null,null,null,null,null,null,null,null,null,null,null,null,null,null,null,null,null,null,null,null,null,"","","","","","","","","","","","","","","","","","","","","","","","","","","","","","",null,92,"Joelho m/f simples 90",null,0.22,0.33,0.44,0.67,0.89,1.1100000000000001,1.33,1.78,0,0,0,0,0,0,0,0]
[null,null,{"$f":"'Cálc. Sist. Extinção Automática'!E36","v":""},{"$f":"IF('Cálc. Sist. Extinção Automática'!F36=\"\",\"\",'Cálc. Sist. Extinção Automática'!F36)","v":""},{"$f":"IF('Cálc. Sist. Extinção Automática'!G36=\"\",\"\",'Cálc. Sist. Extinção Automática'!G36)","v":""},{"$f":"IF('Cálc. Sist. Extinção Automática'!AA36=\"\",\"\",'Cálc. Sist. Extinção Automática'!AA36)","v":""},"",null,"",null,null,null,null,null,null,null,null,null,null,null,null,null,null,null,null,null,null,null,null,null,null,null,null,null,null,null,null,null,null,null,null,null,null,"","","","","","","","","","","","","","","","","","","","","","","","","","","","","","",null,"92R","Joelhos m/f de redução 90",null,0,0,0,0,0,0,0,0,0,0,0,0,0,0,0,0]
[null,null,{"$f":"'Cálc. Sist. Extinção Automática'!E37","v":""},{"$f":"IF('Cálc. Sist. Extinção Automática'!F37=\"\",\"\",'Cálc. Sist. Extinção Automática'!F37)","v":""},{"$f":"IF('Cálc. Sist. Extinção Automática'!G37=\"\",\"\",'Cálc. Sist. Extinção Automática'!G37)","v":""},{"$f":"IF('Cálc. Sist. Extinção Automática'!AA37=\"\",\"\",'Cálc. Sist. Extinção Automática'!AA37)","v":""},"",null,"",null,null,null,null,null,null,null,null,null,null,null,null,null,null,null,null,null,null,null,null,null,null,null,null,null,null,null,null,null,null,null,null,null,null,"","","","","","","","","","","","","","","","","","","","","","","","","","","","","","",null,95,"Joelho c/ junção, s/d, fêmea",null,0.24,0.36,0.48,0.72,0.97,1.21,1.46,1.94,2.44,2.94,3.91,0,0,0,0,0]
[null,null,{"$f":"'Cálc. Sist. Extinção Automática'!E38","v":""},{"$f":"IF('Cálc. Sist. Extinção Automática'!F38=\"\",\"\",'Cálc. Sist. Extinção Automática'!F38)","v":""},{"$f":"IF('Cálc. Sist. Extinção Automática'!G38=\"\",\"\",'Cálc. Sist. Extinção Automática'!G38)","v":""},{"$f":"IF('Cálc. Sist. Extinção Automática'!AA38=\"\",\"\",'Cálc. Sist. Extinção Automática'!AA38)","v":""},"",null,"",null,null,null,null,null,null,null,null,null,null,null,null,null,null,null,null,null,null,null,null,null,null,null,null,null,null,null,null,null,null,null,null,null,null,"","","","","","","","","","","","","","","","","","","","","","","","","","","","","","",null,96,"Joelho c/ junção, s/c, fêmea",null,0.24,0.36,0.48,0.72,0.97,1.21,1.46,1.94,2.44,2.94,3.91,0,0,0,0,0]
[null,null,{"$f":"'Cálc. Sist. Extinção Automática'!E39","v":""},{"$f":"IF('Cálc. Sist. Extinção Automática'!F39=\"\",\"\",'Cálc. Sist. Extinção Automática'!F39)","v":""},{"$f":"IF('Cálc. Sist. Extinção Automática'!G39=\"\",\"\",'Cálc. Sist. Extinção Automática'!G39)","v":""},{"$f":"IF('Cálc. Sist. Extinção Automática'!AA39=\"\",\"\",'Cálc. Sist. Extinção Automática'!AA39)","v":""},"",null,"",null,null,null,null,null,null,null,null,null,null,null,null,null,null,null,null,null,null,null,null,null,null,null,null,null,null,null,null,null,null,null,null,null,null,"","","","","","","","","","","","","","","","","","","","","","","","","","","","","","",null,97,"Joelho c/ junção, s/d, m/f",null,0.24,0.36,0.48,0.72,0.97,1.21,1.46,1.94,2.44,2.94,3.91,0,0,0,0,0]
[null,null,{"$f":"'Cálc. Sist. Extinção Automática'!E40","v":""},{"$f":"IF('Cálc. Sist. Extinção Automática'!F40=\"\",\"\",'Cálc. Sist. Extinção Automática'!F40)","v":""},{"$f":"IF('Cálc. Sist. Extinção Automática'!G40=\"\",\"\",'Cálc. Sist. Extinção Automática'!G40)","v":""},{"$f":"IF('Cálc. Sist. Extinção Automática'!AA40=\"\",\"\",'Cálc. Sist. Extinção Automática'!AA40)","v":""},"",null,"",null,null,null,null,null,null,null,null,null,null,null,null,null,null,null,null,null,null,null,null,null,null,null,null,null,null,null,null,null,null,null,null,null,null,"","","","","","","","","","","","","","","","","","","","","","","","","","","","","","",null,98,"Joelho c/ junção, s/c, m/f",null,0.24,0.36,0.48,0.72,0.97,1.21,1.46,1.94,2.44,2.94,3.91,0,0,0,0,0]
[null,null,{"$f":"'Cálc. Sist. Extinção Automática'!E41","v":""},{"$f":"IF('Cálc. Sist. Extinção Automática'!F41=\"\",\"\",'Cálc. Sist. Extinção Automática'!F41)","v":""},{"$f":"IF('Cálc. Sist. Extinção Automática'!G41=\"\",\"\",'Cálc. Sist. Extinção Automática'!G41)","v":""},{"$f":"IF('Cálc. Sist. Extinção Automática'!AA41=\"\",\"\",'Cálc. Sist. Extinção Automática'!AA41)","v":""},"",null,"",null,null,null,null,null,null,null,null,null,null,null,null,null,null,null,null,null,null,null,null,null,null,null,null,null,null,null,null,null,null,null,null,null,null,"","","","","","","","","","","","","","","","","","","","","","","","","","","","","","",null,120,"Joelho simples 45",null,0,0.16,0.22,0.32,0.43,0.54,0.65,0.86,1.08,1.3,1.73,2.16,2.59,0,0,0]
[null,null,{"$f":"'Cálc. Sist. Extinção Automática'!E42","v":""},{"$f":"IF('Cálc. Sist. Extinção Automática'!F42=\"\",\"\",'Cálc. Sist. Extinção Automática'!F42)","v":""},{"$f":"IF('Cálc. Sist. Extinção Automática'!G42=\"\",\"\",'Cálc. Sist. Extinção Automática'!G42)","v":""},{"$f":"IF('Cálc. Sist. Extinção Automática'!AA42=\"\",\"\",'Cálc. Sist. Extinção Automática'!AA42)","v":""},"",null,"",null,null,null,null,null,null,null,null,null,null,null,null,null,null,null,null,null,null,null,null,null,null,null,null,null,null,null,null,null,null,null,null,null,null,"","","","","","","","","","","","","","","","","","","","","","","","","","","","","","",null,121,"Joelho m/f 45",null,0,0.16,0.22,0.32,0.43,0.54,0.65,0.86,1.08,1.3,1.73,2.16,2.59,0,0,0]
[null,null,{"$f":"'Cálc. Sist. Extinção Automática'!E43","v":""},{"$f":"IF('Cálc. Sist. Extinção Automática'!F43=\"\",\"\",'Cálc. Sist. Extinção Automática'!F43)","v":""},{"$f":"IF('Cálc. Sist. Extinção Automática'!G43=\"\",\"\",'Cálc. Sist. Extinção Automática'!G43)","v":""},{"$f":"IF('Cálc. Sist. Extinção Automática'!AA43=\"\",\"\",'Cálc. Sist. Extinção Automática'!AA43)","v":""},"",null,"",null,null,null,null,null,null,null,null,null,null,null,null,null,null,null,null,null,null,null,null,null,null,null,null,null,null,null,null,null,null,null,null,null,null,"","","","","","","","","","","","","","","","","","","","","","","","","","","","","","",null,130,"Tê simples 90",null,0.04,0.06,0.08,0.12,0.17,0.21,0.25,0.33,0.41,0.5,0.66,0.83,0.99,0,0,0]
[null,null,{"$f":"'Cálc. Sist. Extinção Automática'!E44","v":""},{"$f":"IF('Cálc. Sist. Extinção Automática'!F44=\"\",\"\",'Cálc. Sist. Extinção Automática'!F44)","v":""},{"$f":"IF('Cálc. Sist. Extinção Automática'!G44=\"\",\"\",'Cálc. Sist. Extinção Automática'!G44)","v":""},{"$f":"IF('Cálc. Sist. Extinção Automática'!AA44=\"\",\"\",'Cálc. Sist. Extinção Automática'!AA44)","v":""},"",null,"",null,null,null,null,null,null,null,null,null,null,null,null,null,null,null,null,null,null,null,null,null,null,null,null,null,null,null,null,null,null,null,null,null,null,"","","","","","","","","","","","","","","","","","","","","","","","","","","","","","",null,null,null,null,0.34,0.51,0.69,1.03,1.37,1.71,2.06,2.74,3.43,4.1100000000000003,5.49,6.86,8.23,0,0,0]
[null,null,{"$f":"'Cálc. Sist. Extinção Automática'!E45","v":""},{"$f":"IF('Cálc. Sist. Extinção Automática'!F45=\"\",\"\",'Cálc. Sist. Extinção Automática'!F45)","v":""},{"$f":"IF('Cálc. Sist. Extinção Automática'!G45=\"\",\"\",'Cálc. Sist. Extinção Automática'!G45)","v":""},{"$f":"IF('Cálc. Sist. Extinção Automática'!AA45=\"\",\"\",'Cálc. Sist. Extinção Automática'!AA45)","v":""},"",null,"",null,null,null,null,null,null,null,null,null,null,null,null,null,null,null,null,null,null,null,null,null,null,null,null,null,null,null,null,null,null,null,null,null,null,"","","","","","","","","","","","","","","","","","","","","","","","","","","","","","",null,null,null,null,0.42,0.62,0.83,1.25,1.66,2.08,2.5,3.33,4.16,4.99,6.65,8.32,9.98,0,0,0]
[null,null,{"$f":"'Cálc. Sist. Extinção Automática'!E46","v":""},{"$f":"IF('Cálc. Sist. Extinção Automática'!F46=\"\",\"\",'Cálc. Sist. Extinção Automática'!F46)","v":""},{"$f":"IF('Cálc. Sist. Extinção Automática'!G46=\"\",\"\",'Cálc. Sist. Extinção Automática'!G46)","v":""},{"$f":"IF('Cálc. Sist. Extinção Automática'!AA46=\"\",\"\",'Cálc. Sist. Extinção Automática'!AA46)","v":""},"",null,"",null,null,null,null,null,null,null,null,null,null,null,null,null,null,null,null,null,null,null,null,null,null,null,null,null,null,null,null,null,null,null,null,null,null,"","","","","","","","","","","","","","","","","","","","","","","","","","","","","","",null,"130R","Tê de redução",null,0,0.05,7.0000000000000007E-2,0.1,0.14000000000000001,0.17,0.21,0.28000000000000003,0.35,0.42,0.56000000000000005,0,0,0,0,0]
[null,null,{"$f":"'Cálc. Sist. Extinção Automática'!E47","v":""},{"$f":"IF('Cálc. Sist. Extinção Automática'!F47=\"\",\"\",'Cálc. Sist. Extinção Automática'!F47)","v":""},{"$f":"IF('Cálc. Sist. Extinção Automática'!G47=\"\",\"\",'Cálc. Sist. Extinção Automática'!G47)","v":""},{"$f":"IF('Cálc. Sist. Extinção Automática'!AA47=\"\",\"\",'Cálc. Sist. Extinção Automática'!AA47)","v":""},"",null,"",null,null,null,null,null,null,null,null,null,null,null,null,null,null,null,null,null,null,null,null,null,null,null,null,null,null,null,null,null,null,null,null,null,null,"","","","","","","","","","","","","","","","","","","","","","","","","","","","","",""]
[null,null,{"$f":"'Cálc. Sist. Extinção Automática'!E48","v":""},{"$f":"IF('Cálc. Sist. Extinção Automática'!F48=\"\",\"\",'Cálc. Sist. Extinção Automática'!F48)","v":""},{"$f":"IF('Cálc. Sist. Extinção Automática'!G48=\"\",\"\",'Cálc. Sist. Extinção Automática'!G48)","v":""},{"$f":"IF('Cálc. Sist. Extinção Automática'!AA48=\"\",\"\",'Cálc. Sist. Extinção Automática'!AA48)","v":""},"",null,"",null,null,null,null,null,null,null,null,null,null,null,null,null,null,null,null,null,null,null,null,null,null,null,null,null,null,null,null,null,null,null,null,null,null,"","","","","","","","","","","","","","","","","","","","","","","","","","","","","","",null,null,null,null,0.06,null,null,null,0.17,null,null,0.34]
[null,null,{"$f":"'Cálc. Sist. Extinção Automática'!E49","v":""},{"$f":"IF('Cálc. Sist. Extinção Automática'!F49=\"\",\"\",'Cálc. Sist. Extinção Automática'!F49)","v":""},{"$f":"IF('Cálc. Sist. Extinção Automática'!G49=\"\",\"\",'Cálc. Sist. Extinção Automática'!G49)","v":""},{"$f":"IF('Cálc. Sist. Extinção Automática'!AA49=\"\",\"\",'Cálc. Sist. Extinção Automática'!AA49)","v":""},"",null,"",null,null,null,null,null,null,null,null,null,null,null,null,null,null,null,null,null,null,null,null,null,null,null,null,null,null,null,null,null,null,null,null,null,null,"","","","","","","","","","","","","","","","","","","","","","","","","","","","","","",null,null,null,null,null,0.09,null,null,0.2]
[null,null,null,null,null,null,null,null,null,null,null,null,null,null,null,null,null,null,null,null,null,null,null,null,null,null,null,null,null,null,null,null,null,null,null,null,null,null,null,null,null,null,null,null,null,null,null,null,null,null,null,null,null,null,null,null,null,null,null,null,null,null,null,null,null,null,null,null,null,null,null,null,null,null,null,null,null,null,null,0.11,null,null,0.23]
[null,null,null,null,null,null,null,null,null,null,null,null,null,null,null,null,null,null,null,null,null,null,null,null,null,null,null,null,null,null,null,null,null,null,null,null,null,null,null,null,null,null,null,null,null,null,null,null,null,null,null,null,null,null,null,null,null,null,null,null,null,null,null,null,null,null,null,null,null,null,null,null,null,null,null,null,null,null,null,0.13,null,null,null,0.28999999999999998]
[null,null,null,null,null,null,null,null,null,null,null,null,null,null,null,null,null,null,null,null,null,null,null,null,null,null,null,null,null,null,null,null,null,null,null,null,null,null,null,null,null,null,null,null,null,null,null,null,null,null,null,null,null,null,null,null,null,null,null,null,null,null,null,null,null,null,null,null,null,null,null,null,null,null,null,null,null,null,null,null,0.14000000000000001,null,null,0.3]
[null,null,null,null,null,null,null,null,null,null,null,null,null,null,null,null,null,null,null,null,null,null,null,null,null,null,null,null,null,null,null,null,null,null,null,null,null,null,null,null,null,null,null,null,null,null,null,null,null,null,null,null,null,null,null,null,null,null,null,null,null,null,null,null,null,null,null,null,null,null,null,null,null,null,null,null,null,null,null,null,0.15,null,null,null,0.46]
[null,null,null,null,null,null,null,null,null,null,null,null,null,null,null,null,null,null,null,null,null,null,null,null,null,null,null,null,null,null,null,null,null,null,null,null,null,null,null,null,null,null,null,null,null,null,null,null,null,null,null,null,null,null,null,null,null,null,null,null,null,null,null,null,null,null,null,null,null,null,null,null,null,null,null,null,null,null,null,null,null,null,0.25]
[null,null,null,null,null,null,null,null,null,null,null,null,null,null,null,null,null,null,null,null,null,null,null,null,null,null,null,null,null,null,null,null,null,null,null,null,null,null,null,null,null,null,null,null,null,null,null,null,null,null,null,null,null,null,null,null,null,null,null,null,null,null,null,null,null,null,null,null,null,null,null,null,null,null,131,"Tê 90 c/ ramal curvo",null,0,0,0,0,0,0,0,0,0,0,0,0,0,0,0,0]
[null,null,null,null,null,null,null,null,null,null,null,null,null,null,null,null,null,null,null,null,null,null,null,null,null,null,null,null,null,null,null,null,null,null,null,null,null,null,null,null,null,null,null,null,null,null,null,null,null,null,null,null,null,null,null,null,null,null,null,null,null,null,null,null,null,null,null,null,null,null,null,null,null,null,180,"Cruzeta",null,0.05,0.08,0.1,0.15,0.2,0.25,0.3,0.41,0,0,0,0,0,0,0,0]
[null,null,null,null,null,null,null,null,null,null,null,null,null,null,null,null,null,null,null,null,null,null,null,null,null,null,null,null,null,null,null,null,null,null,null,null,null,null,null,null,null,null,null,null,null,null,null,null,null,null,null,null,null,null,null,null,null,null,null,null,null,null,null,null,null,null,null,null,null,null,null,null,null,null,null,null,null,0.34,0.5,0.67,1.01,1.35,1.68,2.02,2.69,0,0,0,0,0,0,0,0]
[null,null,null,null,null,null,null,null,null,null,null,null,null,null,null,null,null,null,null,null,null,null,null,null,null,null,null,null,null,null,null,null,null,null,null,null,null,null,null,null,null,null,null,null,null,null,null,null,null,null,null,null,null,null,null,null,null,null,null,null,null,null,null,null,null,null,null,null,null,null,null,null,null,null,221,"Joelho de 3 vias",null,0,0.61,0.81,1.22,1.63,2.0299999999999998,2.44,3.25,0,0,0,0,0,0,0,0]
[null,null,null,null,null,null,null,null,null,null,null,null,null,null,null,null,null,null,null,null,null,null,null,null,null,null,null,null,null,null,null,null,null,null,null,null,null,null,null,null,null,null,null,null,null,null,null,null,null,null,null,null,null,null,null,null,null,null,null,null,null,null,null,null,null,null,null,null,null,null,null,null,null,null,240,"União de redução",null,0,0.2,0.3,0.5,0.65,0.85,1,1.3,2,2.2999999999999998,3,0,0,0,0,0]
[null,null,null,null,null,null,null,null,null,null,null,null,null,null,null,null,null,null,null,null,null,null,null,null,null,null,null,null,null,null,null,null,null,null,null,null,null,null,null,null,null,null,null,null,null,null,null,null,null,null,null,null,null,null,null,null,null,null,null,null,null,null,null,null,null,null,null,null,null,null,null,null,null,null,241,"Casquilhos de redução",null,0,0,0,0,0,0,0,0,0,0,0,0,0,0,0,0]
[null,null,null,null,null,null,null,null,null,null,null,null,null,null,null,null,null,null,null,null,null,null,null,null,null,null,null,null,null,null,null,null,null,null,null,null,null,null,null,null,null,null,null,null,null,null,null,null,null,null,null,null,null,null,null,null,null,null,null,null,null,null,null,null,null,null,null,null,null,null,null,null,null,null,245,"Casquilhos duplos de redução",null,0,0,0,0,0,0,0,0,0,0,0,0,0,0,0,0]
[null,null,null,null,null,null,null,null,null,null,null,null,null,null,null,null,null,null,null,null,null,null,null,null,null,null,null,null,null,null,null,null,null,null,null,null,null,null,null,null,null,null,null,null,null,null,null,null,null,null,null,null,null,null,null,null,null,null,null,null,null,null,null,null,null,null,null,null,null,null,null,null,null,null,246,"Uniões m/f de redução",null,0,0.2,0.3,0.5,0.65,0.85,1,1.3,2,2.2999999999999998,3,0,0,0,0,0]
[null,null,null,null,null,null,null,null,null,null,null,null,null,null,null,null,null,null,null,null,null,null,null,null,null,null,null,null,null,null,null,null,null,null,null,null,null,null,null,null,null,null,null,null,null,null,null,null,null,null,null,null,null,null,null,null,null,null,null,null,null,null,null,null,null,null,null,null,null,null,null,null,null,null,270,"União simples",null,0.01,0.01,0.01,0.02,0.03,0.04,0.05,0.06,0.09,0.12,0.15,0.2,0.3,0,0,0]
[null,null,null,null,null,null,null,null,null,null,null,null,null,null,null,null,null,null,null,null,null,null,null,null,null,null,null,null,null,null,null,null,null,null,null,null,null,null,null,null,null,null,null,null,null,null,null,null,null,null,null,null,null,null,null,null,null,null,null,null,null,null,null,null,null,null,null,null,null,null,null,null,null,null,271,"União c/ rosca dir./esq.",null,0.01,0.01,0.01,0.02,0.03,0.04,0.05,0.06,0.09,0.12,0.15,0.2,0.3,0,0,0]
[null,null,null,null,null,null,null,null,null,null,null,null,null,null,null,null,null,null,null,null,null,null,null,null,null,null,null,null,null,null,null,null,null,null,null,null,null,null,null,null,null,null,null,null,null,null,null,null,null,null,null,null,null,null,null,null,null,null,null,null,null,null,null,null,null,null,null,null,null,null,null,null,null,null,280,"Casquilho duplo",null,0,0,0,0,0,0,0,0,0,0,0,0,0,0,0,0]
[null,null,null,null,null,null,null,null,null,null,null,null,null,null,null,null,null,null,null,null,null,null,null,null,null,null,null,null,null,null,null,null,null,null,null,null,null,null,null,null,null,null,null,null,null,null,null,null,null,null,null,null,null,null,null,null,null,null,null,null,null,null,null,null,null,null,null,null,null,null,null,null,null,null,281,"Casquilho duplo c/ rosca dir./esq.",null,0,0,0,0,0,0,0,0,0,0,0,0,0,0,0,0]
[null,null,null,null,null,null,null,null,null,null,null,null,null,null,null,null,null,null,null,null,null,null,null,null,null,null,null,null,null,null,null,null,null,null,null,null,null,null,null,null,null,null,null,null,null,null,null,null,null,null,null,null,null,null,null,null,null,null,null,null,null,null,null,null,null,null,null,null,null,null,null,null,null,null,330,"Junção sede plana",null,0.01,0.01,0.01,0.02,0.03,0.04,0.05,0.06,0.09,0.12,0.15,0,0,0,0,0]
[null,null,null,null,null,null,null,null,null,null,null,null,null,null,null,null,null,null,null,null,null,null,null,null,null,null,null,null,null,null,null,null,null,null,null,null,null,null,null,null,null,null,null,null,null,null,null,null,null,null,null,null,null,null,null,null,null,null,null,null,null,null,null,null,null,null,null,null,null,null,null,null,null,null,331,"Junção sede plana, m/f",null,0.01,0.01,0.01,0.02,0.03,0.04,0.05,0.06,0.09,0.12,0.15,0,0,0,0,0]
[null,null,null,null,null,null,null,null,null,null,null,null,null,null,null,null,null,null,null,null,null,null,null,null,null,null,null,null,null,null,null,null,null,null,null,null,null,null,null,null,null,null,null,null,null,null,null,null,null,null,null,null,null,null,null,null,null,null,null,null,null,null,null,null,null,null,null,null,null,null,null,null,null,null,340,"Junção sede cónica",null,0.01,0.01,0.01,0.02,0.03,0.04,0.05,0.06,0.09,0.12,0.15,0,0,0,0,0]
[null,null,null,null,null,null,null,null,null,null,null,null,null,null,null,null,null,null,null,null,null,null,null,null,null,null,null,null,null,null,null,null,null,null,null,null,null,null,null,null,null,null,null,null,null,null,null,null,null,null,null,null,null,null,null,null,null,null,null,null,null,null,null,null,null,null,null,null,null,null,null,null,null,null,341,"Junção sede cónica, m/f",null,0.01,0.01,0.01,0.02,0.03,0.04,0.05,0.06,0.09,0.12,0.15,0,0,0,0,0]
[null,null,null,null,null,null,null,null,null,null,null,null,null,null,null,null,null,null,null,null,null,null,null,null,null,null,null,null,null,null,null,null,null,null,null,null,null,null,null,null,null,null,null,null,null,null,null,null,null,null,null,null,null,null,null,null,null,null,null,null,null,null,null,null,null,null,null,null,null,null,null,null,null,null,526,"União Alongamento",null,0.01,0.01,0.01,0.02,0.03,0.04,0.05,0.06,0.09,0.12,0.15,0,0,0,0,0]
[null,null,null,null,null,null,null,null,null,null,null,null,null,null,null,null,null,null,null,null,null,null,null,null,null,null,null,null,null,null,null,null,null,null,null,null,null,null,null,null,null,null,null,null,null,null,null,null,null,null,null,null,null,null,null,null,null,null,null,null,null,null,null,null,null,null,null,null,null,null,null,null,null,null,"529a","União m/f simples",null,0.01,0.01,0.01,0.02,0.03,0.04,0.05,0.06,0.09,0.12,0.15,0,0,0,0,0]
[null,null,null,null,null,null,null,null,null,null,null,null,null,null,null,null,null,null,null,null,null,null,null,null,null,null,null,null,null,null,null,null,null,null,null,null,null,null,null,null,null,null,null,null,null,null,null,null,null,null,null,null,null,null,null,null,null,null,null,null,null,null,null,null,null,null,null,null,null,null,null,null,null,null,null,null,null,"Dimensão do Acessório Ranhurado em ferro fundido dúctil"]
[null,null,null,null,null,null,null,null,null,null,null,null,null,null,null,null,null,null,null,null,null,null,null,null,null,null,null,null,null,null,null,null,null,null,null,null,null,null,null,null,null,null,null,null,null,null,null,null,null,null,null,null,null,null,null,null,null,null,null,null,null,null,null,null,null,null,null,null,null,null,null,null,null,null,null,null,null,0.25,0.375,0.5,0.75,1,1.25,1.5,2,2.5,3,4,5,6,8,10,12]
[null,null,null,null,null,null,null,null,null,null,null,null,null,null,null,null,null,null,null,null,null,null,null,null,null,null,null,null,null,null,null,null,null,null,null,null,null,null,null,null,null,null,null,null,null,null,null,null,null,null,null,null,null,null,null,null,null,null,null,null,null,null,null,null,null,null,null,null,null,null,null,null,null,null,"RN","União ranhurada",null,0,0,0,0,0.18,0.18,0.18,0.18,0.18,0.18,0.18,0.18,0.18,0.18,0.18,0.18]
[null,null,null,null,null,null,null,null,null,null,null,null,null,null,null,null,null,null,null,null,null,null,null,null,null,null,null,null,null,null,null,null,null,null,null,null,null,null,null,null,null,null,null,null,null,null,null,null,null,null,null,null,null,null,null,null,null,null,null,null,null,null,null,null,null,null,null,null,null,null,null,null,null,null,"FR","Uniáo de red. ranhurada",null,0,0,0,0,0,0,0,0.6,0.6,1.2,1.8,0,0,0,0,0]
[null,null,null,null,null,null,null,null,null,null,null,null,null,null,null,null,null,null,null,null,null,null,null,null,null,null,null,null,null,null,null,null,null,null,null,null,null,null,null,null,null,null,null,null,null,null,null,null,null,null,null,null,null,null,null,null,null,null,null,null,null,null,null,null,null,null,null,null,null,null,null,null,null,null,90,"Joelho 90º ranhurado",null,0,0,0,0,0.9,1,1.1000000000000001,1.2,1.5,1.65,2.2999999999999998,2.75,3.3,4.4000000000000004,5.2,6.1]
[null,null,null,null,null,null,null,null,null,null,null,null,null,null,null,null,null,null,null,null,null,null,null,null,null,null,null,null,null,null,null,null,null,null,null,null,null,null,null,null,null,null,null,null,null,null,null,null,null,null,null,null,null,null,null,null,null,null,null,null,null,null,null,null,null,null,null,null,null,null,null,null,null,null,120,"Joelho 45º ranhurado",null,0,0,0,0,0.43,0.45,0.48,0.55000000000000004,0.75,0.88,1.1000000000000001,1.42,1.65,1.65,2.25,2.6]
[null,null,null,null,null,null,null,null,null,null,null,null,null,null,null,null,null,null,null,null,null,null,null,null,null,null,null,null,null,null,null,null,null,null,null,null,null,null,null,null,null,null,null,null,null,null,null,null,null,null,null,null,null,null,null,null,null,null,null,null,null,null,null,null,null,null,null,null,null,null,null,null,null,null,130,"Tê ranhurado",null,0,0,0,0,0.95,0.95,1.05,1.2,1.5,1.65,2.2999999999999998,2.75,3.3,4.4000000000000004,5.0999999999999996,6.2]
[null,null,null,null,null,null,null,null,null,null,null,null,null,null,null,null,null,null,null,null,null,null,null,null,null,null,null,null,null,null,null,null,null,null,null,null,null,null,null,null,null,null,null,null,null,null,null,null,null,null,null,null,null,null,null,null,null,null,null,null,null,null,null,null,null,null,null,null,null,null,null,null,null,null,null,null,null,0,0,0,0,2.2000000000000002,2.35,2.5,2.85,3.75,4.4000000000000004,5.4,6.95,8.35,11.1,12.6,15.7]
[null,null,null,null,null,null,null,null,null,null,null,null,null,null,null,null,null,null,null,null,null,null,null,null,null,null,null,null,null,null,null,null,null,null,null,null,null,null,null,null,null,null,null,null,null,null,null,null,null,null,null,null,null,null,null,null,null,null,null,null,null,null,null,null,null,null,null,null,null,null,null,null,null,null,"DA1","Derivação roscada",null,0,0,0,0,0.9,1.2,1.2,1.8,2.4,3.1,4.3,0,0,0,0,0]
[null,null,null,null,null,null,null,null,null,null,null,null,null,null,null,null,null,null,null,null,null,null,null,null,null,null,null,null,null,null,null,null,null,null,null,null,null,null,null,null,null,null,null,null,null,null,null,null,null,null,null,null,null,null,null,null,null,null,null,null,null,null,null,null,null,null,null,null,null,null,null,null,null,null,null,null,null,"Dimensão da Válvula em ferro fundido dúctil ou latão"]
[null,null,null,null,null,null,null,null,null,null,null,null,null,null,null,null,null,null,null,null,null,null,null,null,null,null,null,null,null,null,null,null,null,null,null,null,null,null,null,null,null,null,null,null,null,null,null,null,null,null,null,null,null,null,null,null,null,null,null,null,null,null,null,null,null,null,null,null,null,null,null,null,null,null,null,null,null,0.25,0.375,0.5,0.75,1,1.25,1.5,2,2.5,3,4,5,6,8,10,12]
[null,null,null,null,null,null,null,null,null,null,null,null,null,null,null,null,null,null,null,null,null,null,null,null,null,null,null,null,null,null,null,null,null,null,null,null,null,null,null,null,null,null,null,null,null,null,null,null,null,null,null,null,null,null,null,null,null,null,null,null,null,null,null,null,null,null,null,null,null,null,null,null,null,null,600,"Válvula de comporta",null,0,0,0.1,0.1,0.2,0.2,0.3,0.4,0.4,0.5,0.7,0.9,1.1000000000000001,1.4,1.7,2.1]
[null,null,null,null,null,null,null,null,null,null,null,null,null,null,null,null,null,null,null,null,null,null,null,null,null,null,null,null,null,null,null,null,null,null,null,null,null,null,null,null,null,null,null,null,null,null,null,null,null,null,null,null,null,null,null,null,null,null,null,null,null,null,null,null,null,null,null,null,null,null,null,null,null,null,172,"Válvula de globo",null,0,0,4.9000000000000004,6.7,8.1999999999999993,11.3,13.4,17.399999999999999,21,26,34,43,51,67,85,102]
[null,null,null,null,null,null,null,null,null,null,null,null,null,null,null,null,null,null,null,null,null,null,null,null,null,null,null,null,null,null,null,null,null,null,null,null,null,null,null,null,null,null,null,null,null,null,null,null,null,null,null,null,null,null,null,null,null,null,null,null,null,null,null,null,null,null,null,null,null,null,null,null,null,null,640,"Válvula de retenção",null,0,0,1.1000000000000001,1.6,2.1,2.7,3.2,4.2,5.2,6.3,8.4,10.4,12.5,16,20,24]
[null,null,null,null,null,null,null,null,null,null,null,null,null,null,null,null,null,null,null,null,null,null,null,null,null,null,null,null,null,null,null,null,null,null,null,null,null,null,null,null,null,null,null,null,null,null,null,null,null,null,null,null,null,null,null,null,null,null,null,null,null,null,null,null,null,null,null,null,null,null,null,null,null,null,null,null,null,0,0,1.6,2.4,3.2,4,4.8,6.4,8.1,9.6999999999999993,12.9,16.100000000000001,19.3,25,32,38]
[null,null,null,null,null,null,null,null,null,null,null,null,null,null,null,null,null,null,null,null,null,null,null,null,null,null,null,null,null,null,null,null,null,null,null,null,null,null,null,null,null,null,null,null,null,null,null,null,null,null,null,null,null,null,null,null,null,null,null,null,null,null,null,null,null,null,null,null,null,null,null,null,null,null,196,"Válvula de aspiração",null,0,0,3.6,5.6,7.3,10,11.6,14,17,20,23,30,39,52,65,78]
[null,null,null,null,null,null,null,null,null,null,null,null,null,null,null,null,null,null,null,null,null,null,null,null,null,null,null,null,null,null,null,null,null,null,null,null,null,null,null,null,null,null,null,null,null,null,null,null,null,null,null,null,null,null,null,null,null,null,null,null,null,null,null,null,null,null,null,null,null,null,null,null,null,null,"BI","Válvula de corte BI",null,0,0,2.6,3.6,4.5999999999999996,5.6,6.7,8.5,10,13,17,21,26,34,43,51]

{"sheet":"Quadros 3 a 5-RTSCIE","index":4,"n_rows":2,"n_cols":2,"rows_kept":2,"cut":false,"hidden":false,"merged":[[12,3,12,5],[12,7,13,7],[12,8,13,8],[10,10,11,10],[9,11,10,11],[10,7,11,7],[10,8,11,8],[8,10,9,10],[12,9,13,9],[12,10,13,10],[8,9,9,9],[12,6,13,6],[13,3,13,5],[3,2,3,11],[4,1,4,2],[4,3,4,5],[4,6,5,6],[4,7,4,10],[6,1,6,2],[4,11,5,11],[5,7,6,7],[10,9,11,9],[9,2,10,2],[9,3,10,5],[7,3,7,5],[8,3,8,5],[6,3,6,5],[8,6,11,6],[8,7,9,7],[11,3,11,5],[8,8,9,8]]}
[]
[null," RTSCIE - Dimensionamento de Sistema de Extinção Automática (Rede de Sprinklers Tipo Húmida)"]

{"sheet":"Quadros 3 a 5-EN 12845","index":5,"n_rows":0,"n_cols":0,"rows_kept":0,"cut":false,"hidden":false,"merged":[[3,2,3,11],[4,1,4,2],[4,3,4,5],[4,6,5,6],[4,7,4,10],[4,11,5,11],[5,7,6,7],[6,1,6,2],[6,3,6,5],[7,3,7,5],[8,3,8,5],[8,6,11,6],[8,7,9,7],[8,8,9,8],[9,11,10,11],[10,7,11,7],[10,8,11,8],[10,9,11,9],[10,10,11,10],[8,9,9,9],[12,10,13,10],[13,3,13,5],[8,10,9,10],[9,2,10,2],[9,3,10,5],[11,3,11,5],[12,3,12,5],[12,6,13,6],[12,7,13,7],[12,8,13,8],[12,9,13,9]]}

{"sheet":"Quadros 3 a 6-NFPA 13","index":6,"n_rows":64,"n_cols":17,"rows_kept":64,"cut":false,"hidden":false,"merged":[[62,1,62,5],[52,1,52,2],[17,2,17,5],[25,2,25,4],[51,2,51,5],[26,1,26,2],[29,1,29,2],[18,1,18,2],[44,1,46,1],[47,1,48,1],[5,7,6,7],[14,2,14,5],[4,1,4,2],[4,3,4,5],[9,3,10,5],[6,1,6,2],[6,3,6,5],[7,3,7,5],[3,2,3,11],[12,6,13,6],[13,3,13,5],[8,3,8,5],[8,6,11,6],[11,3,11,5],[9,2,10,2],[12,3,12,5],[10,7,11,7],[4,11,5,11],[4,6,5,6],[4,7,4,10],[10,8,11,8],[10,9,11,9],[10,10,11,10],[8,9,9,9],[9,11,10,11],[8,7,9,7],[8,8,9,8],[12,7,13,7],[12,8,13,8],[12,9,13,9],[12,10,13,10],[8,10,9,10]]}
[]
[null,null,null,null,null,null,null,null,null,null,null,null,null,null,"Utilização Tipo II (RTSCIE)",8,1]
[null,null,null,null,null,null,null,null,null,null,null,null,null,null,"Utilização Tipo III (RTSCIE)",9,2]
[null,"Quadro 3:","Área máxima de cobertura por sprinkler, valores de S e D e área de operação em função da classe de risco",null,null,null,null,null,null,null,null,null,null,null,"Utilização Tipo VI (RTSCIE)",9,3]
[null,"Classe de Risco",null,"Tipo de edifício",null,null,"Área máxima a proteger por sprinkler (As)","Valores de S e D",null,null,null,"Área de operação (Ao)",null,null,"Utilização Tipo VII (RTSCIE)",9,4]
[null,null,null,null,null,null,null,"Tipo de disposição","S","D","SxD",null,null,null,"Utilização Tipo VIII (RTSCIE)",9,5]
[null,null,null,null,null,null,"(m2)",null,"(m)","(m)","(m2)","(m2)",null,null,"Utilização Tipo XII (RTSCIE)",10,6]
[null,"Ligeiros",null,"Apartamentos, igrejas, clubes, escolas, hospitais, escritórios, museus, etc.",null,null,20,"Normal",4,4.5999999999999996,20,139,null,null,"Ligeiro (EN 12845)",11,7]
[null,"Ordinários","Grupo 1","Garagens, padarias, casas de caldeiras, fábricas de componentes eléctricos, parques de estacionamento, lavandarias, teatros, áreas de serviços em restaurantes.",null,null,12,"Normal (opcional)",4,4.5999999999999996,12,139,null,null,"Ordinário - Grupo 1 (EN 12845)",12,8]
[null,null,"Grupo 2","Fábricas de: produtos químicos de baixo risco, máquinas, têxteis, cigarros, tintas.",null,null,null,null,null,null,null,279,null,null,"Ordinário - Grupo 2 (EN 12845)",13,9]
[null,null,null,null,null,null,null,"Intercalado (opcional)",4.5999999999999996,4,12,null,null,null,"Ordinário - Grupo 3 (EN 12845)",14,10]
[null,null,"Grupo 3","Fábricas de papel, refinarias, fábricas de pneus, armazéns de produtos inflamáveis, etc.",null,null,null,null,null,null,null,372,null,null,"Ordinário - Grupo 4 (EN 12845)",15,11]
[null,"Graves","Grupo 1","Áreas com combustíveis, fábricas de tintas e diluentes, vulcanizações, etc. ",null,null,9,"Normal",3.7,3.7,9,372,null,null,"Extra - Grupo 1 (EN 12845)",16,12]
[null,null,"Grupo 2","Fábricas de embalagens de gás, de sprays, de poliuretanos, etc.",null,null,null,null,null,null,null,465,null,null,"Extra - Grupo 2 (EN 12845)",17,13]
[null,"Legenda:","S – Espaçamento máximo entre sprinklers",null,null,null,null,null,null,null,null,null,null,null,"Extra - Grupo 3 (EN 12845)",18,14]
[null,null,"D – Afastamento máximo dos ramais ",null,null,null,null,null,null,null,null,null,null,null,"Ligeiros (NFPA 13)",1,15]
[null,null,null,null,null,null,null,null,null,null,null,null,null,null,"Ordinários - Grupo 1 (NFPA 13)",2,16]
[null,"Quadro 4:","Dimensões e características dos sprinklers em função da classe de risco",null,null,null,null,null,{"$f":"I8*J8","v":18.399999999999999},{"$f":"EVEN(L8/G8)","v":8},{"$f":"ODD(1.2*(SQRT(L8)/I8))-1","v":4},null,null,null,"Ordinários - Grupo 2 (NFPA 13)",3,17]
[null,"Classe de Risco",null,"Dimensão","Factor de","Dimensão",null,null,{"$f":"I9*J9","v":18.399999999999999},{"$f":"EVEN(L9/G9)","v":12},{"$f":"ODD(1.2*(SQRT(L9)/I9))-1","v":4},null,null,null,"Ordinários - Grupo 3 (NFPA 13)",4,18]
[null,null,null,"Nominal","escoamento","da rosca",null,null,{"$f":"I11*J11","v":18.399999999999999},{"$f":"EVEN(L10/G9)","v":24},{"$f":"ODD(1.2*(SQRT(L10)/I9))-1","v":6},null,null,null,"Graves - Grupo 1 (NFPA 13)",5,19]
[null,null,null,"(DN)","(K)","(R)",null,null,{"$f":"I13*J13","v":13.690000000000001},{"$f":"EVEN(L12/G9)","v":32},{"$f":"ODD(1.2*(SQRT(L12)/I9))-1","v":6},null,null,null,"Graves - Grupo 2 (NFPA 13)",6,20]
[null,"Ligeiros",null,10,"57 ± 5%",0.375,null,null,null,{"$f":"EVEN(L13/G13)","v":42},{"$f":"ODD(1.2*(SQRT(L13)/I13))-1","v":6},null,null,null,"Outra Classe de Risco",7,21]
[null,"Ordinários /","Graves",15,"80 ± 5%",0.5,null,null,null,{"$f":"EVEN(L14/G13)","v":52},{"$f":"ODD(1.2*(SQRT(L14)/I13))-1","v":6},null,null,null,"UT ou Classe de Risco","Código"]
[null,"Graves",null,20,"115 ± 5%",0.75]
[]
[null,"Quadro 5:","Número máximo de sprinklers alimentados em função da classe de risco e da dimensão nominal da tubagem de aço"]
[null,"Classe de Risco",null,"Dimensão","Nº máx. de sprinklers"]
[null,null,null,"Nominal","alimentados"]
[null,null,null,"(DN)","(NS)"]
[null,"Ligeiros",null,25,2]
[null,null,null,32,3]
[null,null,null,40,5]
[null,null,null,50,10]
[null,null,null,65,30]
[null,null,null,80,60]
[null,"Ordinários",null,25,2]
[null,null,null,32,3]
[null,null,null,40,5]
[null,null,null,50,10]
[null,null,null,65,20]
[null,null,null,80,40]
[null,null,null,100,100]
[null,"Graves",null,25,1]
[null,null,null,32,2]
[null,null,null,40,5]
[null,null,null,50,8]
[null,null,null,65,15]
[null,null,null,80,27]
[null,null,null,100,55]
[null,"Nota: Critério em conformidade com a norma NFPA 13."]
[]
[null,"Quadro 6:","Requisitos de caudal e pressão dinâmica para a fonte de alimentação"]
[null,"Classe de Risco",null,"Caudal","Pressão mín.","Duração mín."]
[null,null,null,"(l/min.)","(kPa)","(min.)"]
[null,"Ligeiros",null,225,"220 + h",30]
[null,"Ordinários","Grupo 1",375,"100 + h",60]
[null,null,null,540,"70 + h"]
[null,null,"Grupo 2",725,"140 + h"]
[null,null,null,1000,"100 + h"]
[null,null,"Grupo 3",1100,"170 + h"]
[null,null,null,1350,"140 + h"]
[null,"Graves",null,"Obtidos através de cálculo hidráulico","140 + h",90]
[null,"h - pressão equivalente à diferença de altura entre a válvula de controlo e o sprinkler colocado na posição mais desfavorável."]
[null,"Nota: Critério em conformidade com as Regras Técnicas do I.S.P.."]

{"sheet":"Gráficos 1 e 2-NFPA 13","index":7,"n_rows":23,"n_cols":12,"rows_kept":23,"cut":false,"hidden":false,"merged":[[5,2,5,5],[16,1,16,3],[5,9,5,10],[16,8,16,10]]}
[]
[]
[]
[null," Gráfico 1 Curvas de densidade - Riscos Ligeiros e Ordinários",null,null,null,null,null,null,"Gráfico 2 Curvas de densidade - Riscos Graves"]
[]
[null,"Área de operação","Densidade",null,null,null,null,null,"Área de operação","Densidade"]
[null," m2","l/min.m2","l/min.m2","l/min.m2","l/min.m2",null,null," m2","l/min.m2","l/min.m2"]
[null,null,"Ligeiro","Ordinário G1","Ordinário G2","Ordinário G3",null,null,null,"Grave G1","Grave G2"]
[]
[null,139,4.0999999999999996,6.52,7.7,8.5,null,null,232,11.8,15.1]
[null,{"$f":"186+6*9.3","v":241.8},3.1,{"$f":"6.1-0.2*4","v":5.3},{"$f":"6.7+0.4*0.2","v":6.78},{"$f":"7.5+0.5*0.2","v":7.6},null,null,279,11.2,14.5]
[null,279,{"$f":"2.7+0.5*0.2","v":2.8000000000000003},4.9000000000000004,{"$f":"6.3+0.6*0.2","v":6.42},7.3,null,null,372,10.1,{"$f":"13.2+0.7*0.2","v":13.34}]
[null,372,2,{"$f":"3.9+0.6*0.2","v":4.0199999999999996},{"$f":"5.5+0.7*0.2","v":5.64},{"$f":"6.5+0.7*0.2","v":6.64},null,null,465,{"$f":"8.7+0.9*0.2","v":8.879999999999999},{"$f":"12.2","v":12.2},"Estimativa"]
[null,465,null,3.3,4.9000000000000004,6.1,null,null,557,null,11.2]
[]
[]
[null,"Utilização das curvas:",null,null,null,null,null,null,"Utilização das curvas:"]
[null,null,"Área de operação","Densidade",null,null,null,null,null,"Área de operação","Densidade"]
[null,null," m2","l/min.m2",null,null,null,null,null," m2","l/min.m2"]
[null,"L",465,{"$f":"CEILING(0.000004*C20^2-0.0112*C20+5.5681,0.01)","v":1.23},null,null,null,null,"GG1",232,{"$f":"CEILING(-0.000003*J20^2-0.0104*J20+14.351,0.01)","v":11.78}]
[null,"OG1",{"$f":"C20","v":465},{"$f":"CEILING(0.000009*C21^2-0.0154*C21+8.4806,0.01)","v":3.27},null,null,null,null,"GG2",{"$f":"J20","v":232},{"$f":"CEILING(0.000004*J21^2-0.015*J21+18.379,0.01)","v":15.120000000000001}]
[null,"OG2",{"$f":"C21","v":465},{"$f":"CEILING(0.000003*C22^2-0.0101*C22+9.0632,0.01)","v":5.0200000000000005}]
[null,"OG3",{"$f":"C22","v":465},{"$f":"CEILING(0.000006*C23^2-0.0113*C23+9.9444,0.01)","v":5.99}]

{"sheet":"Instruções","index":8,"n_rows":0,"n_cols":0,"rows_kept":0,"cut":false,"hidden":false,"merged":[]}

{"sheet":"Procedimento","index":9,"n_rows":87,"n_cols":14,"rows_kept":87,"cut":false,"hidden":false,"merged":[[62,4,63,4],[60,4,61,4],[41,1,42,1],[17,8,17,13],[34,5,35,5],[34,6,35,6],[34,7,35,7],[18,8,18,13],[52,8,52,13],[49,8,49,13],[51,8,51,13],[39,8,39,13],[42,8,42,13],[25,8,25,13],[19,8,19,13],[41,8,41,13],[12,1,13,1],[13,3,16,3],[12,4,16,4],[58,3,59,3],[56,3,57,3],[33,1,34,1],[33,3,36,3],[41,3,43,3],[18,1,19,1],[33,8,33,13],[40,8,40,13],[69,8,69,13],[70,8,70,13],[71,8,71,13],[57,8,57,13],[43,8,44,9],[43,10,44,13],[67,8,67,13],[65,8,66,13],[55,8,55,13],[56,8,56,13],[53,8,53,13],[58,8,58,13],[54,8,54,13],[64,8,64,13],[69,3,71,3],[67,3,68,3],[80,3,80,7],[78,8,78,13],[85,8,85,13],[73,8,73,12],[82,8,82,13],[83,8,83,13],[84,8,84,13],[68,8,68,13],[72,8,72,13],[81,8,81,13],[80,8,80,13],[45,8,45,12],[46,10,46,13],[48,8,48,12],[50,8,50,13],[63,8,63,13],[62,8,62,13],[60,8,61,13],[21,8,21,13],[32,8,32,13],[20,8,20,13],[27,8,27,13],[29,8,29,13],[30,8,30,13],[22,8,22,13],[31,8,31,13],[26,8,26,13],[28,8,28,13],[62,5,63,5],[62,6,63,6],[62,7,63,7],[60,5,61,5],[60,6,61,6],[60,7,61,7]]}
[]
[]
[]
[null,null,"Seleccionar o procedimento pretendido:"]
[null,null,null,"Dimensionamento conforme RTSCIE (X)"]
[null,null,null,"Dimensionamento conforme NFPA 13 ou EN 12845 (X)"]
[]
[]
[null,null,null,null,"Procedimento de Dimensionamento conforme os:",{"$f":"IF(E6=\"x\",\"Critérios NFPA 13 ou EN 12845\",IF(E5=\"x\",\"Critérios RTSCIE\",IF(AND(E5=\"\",E6=\"\",OR('Cálc. Sist. Extinção Automática'!A5=8,'Cálc. Sist. Extinção Automática'!A5=9,'Cálc. Sist. Extinção Automática'!A5=10)),\"Critérios RTSCIE\",\"Critérios NFPA 13 ou EN 12845\")))","v":"Critérios RTSCIE"},null,{"$f":"IF(OR(F9=\"\",F9=0),1,IF(F9=\"Critérios RTSCIE\",1,IF(F9=\"Critérios NFPA 13 ou EN 12845\",2,\"\")))","v":1}]
[]
[null,"Fases",null,"Descrição da fase","N.º","Característica","Simbologia","Unidades","Valor / Fórmula / Observações"]
[]
[null,0,null,"Organizar Desenho da Instalação:","0.2",null,"Exemplos:",null,"Estruturar o desenho da instalação, definindo os troços a dimensionar entre:"]
[null,null,null,"Codificar ou numerar sequencialmente, a partir do sprinkler mais afastado da fonte de alimentação (F.A.), designado por S1, todos os sprinklers em funcionamento simultâneo S1+i e nós até à fonte de alimentação da instalação:",null,"Sprinkler mais afastado da F.A.","S1",null,"- Dois sprinklers em funcionamento simultâneo."]
[null,null,null,null,null,"Sprinkler em funcion. simultâneo","S1, S2, S3..",null,"- Um sprinkler em funcionamento simultâneo e um nó."]
[null,null,null,null,null,"Nó de uma tubagem","A, B, C, etc.",null,"- Dois nós."]
[null,null,null,null,null,null,null,null,"- Um nó e a saída da fonte de alimentação (Sistema de Bombagem)."]
[null,null,null,"(Definindo-se os diversos \"N\" troços de tubagem a dimensionar)","0.1","Nº de troços de uma instalação","N","nº","Nó - Ponto de derivação de uma tubagem."]
[null,1,null,{"$f":"IF($H$9=1,\"Definir a Utilização Tipo (UT) aplicável à instalação:\",IF($H$9=2,\"Definir a Classe e Grupo de Risco aplicável à instalação:\",\"\"))","v":"Definir a Utilização Tipo (UT) aplicável à instalação:"},"1.1",{"$f":"IF($H$9=1,\"Utilização Tipo (UT)\",IF($H$9=2,\"Classe e Grupo de Risco\",\"\"))","v":"Utilização Tipo (UT)"},null,null,{"$f":"IF($H$9=1,\"Consultar Quadro 3-RTSCIE.\",IF($H$9=2,\"Consultar Quadro 3-NFPA 13 ou EN 12845.\",\"\"))","v":"Consultar Quadro 3-RTSCIE."}]
[null,null,null,"Fixar a área de operação:","1.5","Fixar a área de operação","Ao","m2","Consultar Quadro 3."]
[null,null,null,{"$f":"IF($H$9=1,\"Fixar o número de sprinklers em funcionamento simultâneo:\",IF($H$9=2,\"Fixar a área máxima de protecção por sprinkler:\",\"\"))","v":"Fixar o número de sprinklers em funcionamento simultâneo:"},{"$f":"IF($H$9=1,\"1.6\",IF($H$9=2,\"1.2\",\"\"))","v":"1.6"},{"$f":"IF($H$9=1,\"Nº de sprinklers em funcionamento simultâneo\",IF($H$9=2,\"Área máx. de protecção / sprinkler\",\"\"))","v":"Nº de sprinklers em funcionamento simultâneo"},{"$f":"IF($H$9=1,\"NSsim.\",IF($H$9=2,\"As\",\"\"))","v":"NSsim."},{"$f":"IF($H$9=1,\"nº\",IF($H$9=2,\"m2\",\"\"))","v":"nº"},{"$f":"IF($H$9=1,\"Consultar Quadro 3-RTSCIE.\",IF($H$9=2,\"Consultar Quadro 3-NFPA 13 ou EN 12845.\",\"\"))","v":"Consultar Quadro 3-RTSCIE."}]
[null,null,null,{"$f":"IF($H$9=1,\"Calcular a área máxima de protecção por sprinkler:\",IF($H$9=2,\"Calcular o número de sprinklers em funcionamento simultâneo:\",\"\"))","v":"Calcular a área máxima de protecção por sprinkler:"},{"$f":"IF($H$9=2,\"1.6\",IF($H$9=1,\"1.2\",\"\"))","v":"1.2"},{"$f":"IF($H$9=2,\"Nº de sprinklers em funcionamento simultâneo\",IF($H$9=1,\"Área máx. de protecção / sprinkler\",\"\"))","v":"Área máx. de protecção / sprinkler"},{"$f":"IF($H$9=2,\"NSsim.\",IF($H$9=1,\"As\",\"\"))","v":"As"},{"$f":"IF($H$9=2,\"nº\",IF($H$9=1,\"m2\",\"\"))","v":"m2"}]
[null,null,null,"Fixar o espaçamento máximo entre sprinklers:","1.3","Espaçamento máx. entre sprinklers","S","m",{"$f":"IF($H$9=1,\"Consultar Quadro 3-RTSCIE.\",IF($H$9=2,\"Consultar Quadro 3-NFPA 13 ou EN 12845.\",\"\"))","v":"Consultar Quadro 3-RTSCIE."}]
[null,null,null,"Calcular o afastamento máximo dos sub-ramais:","1.4","Afastamento máx. dos sub-ramais ","D","m"]
[null,null,null,"Calcular o número de sprinklers em funcionamento simultâneo por sub-ramal:","1.7","Nº de sprinklers em funcionamento simultâneo por sub-ramal","NS sim. / s.r.","nº"]
[null,null,null,"Calcular o caudal unitário a dispersar por sprinkler:","1.8","Densidade do sprinkler ","q unit.","l/min.m2",{"$f":"IF($H$9=1,\"Consultar Quadro 3-RTSCIE.\",IF($H$9=2,\"Consultar Gráficos 1 e 2-NFPA 13 ou Quadro 3-EN 12845.\",\"\"))","v":"Consultar Quadro 3-RTSCIE."}]
[null,null,null,"Calcular o caudal mínimo necessário ao correcto desempenho de cada sprinkler:","1.9","Caudal mínimo por sprinkler","Qmín.S","l/min"]
[null,null,null,"Fixar o coeficiente de caudal dos sprinklers:","1.10","Coeficiente de caudal do sprinkler","K (métrico)","l/min.bar0,5","Consultar Quadro 4 (referencial de unidades: \"l/min\" e \"bar\")."]
[null,null,null,"Calcular a pressão dinâmica mínima no sprinkler mais afastado da fonte de alimentação:","1.11","Pressão mínima por sprinkler","Pmín.S","kPa"]
[null,null,null,"Fixar a % de afectação das perdas de carga locais:","1.12","% de afectação das perdas carga localizadas","J%","%","Por defeito, é efectuado um acréscimo de 25 % ao comprimento dos troços analisados, para compensação das perdas de carga localizadas (ou Quadro 2)."]
[null,null,null,"Decidir qual a fórmula de dimensionamento a utilizar:","1.13","Cálculo da perda de carga","ΔP","kPa","Cálculo das perdas de carga pelas fórmulas de Flamant ou Hazen & Williams."]
[null,null,null,"Fixar o factor de rugosidade aplicável a tubagens em aço para condução de água fria:","1.14","Constante de Rugosidade","C ou b",null,"Por defeito, no cálculo das perdas de carga, adopta-se C = 120 se usada a Fórmula de Hazen & Williams, ou b = 0,00023 se usada a Fórmula de Flamant."]
[null,null,null,"Fixar a velocidade de escoamento admissível:","9.3","Velocidade admissível","Vadm.","m/s","Por defeito, a velocidade de escoamento admissível deverá situar-se entre 0,5 e 6,0 m/s, nos Ramais Principais (em conformidade com a norma EN 12845)."]
[null,2,null,"Introduzir a codificação dos diferentes troços estabelecida no desenho da instalação (Fase 0), definindo automaticamente os diversos \"N\" troços de tubagem. Com início a partir do sprinkler mais afastado da fonte de alimentação, designado por S1:",null,null,null,null,"Consultar desenho da instalação com os troços de tubagem devidamente codificados e situados entre:"]
[null,null,null,null,"0.1","N.º de troços de uma instalação","N","nº","- Dois sprinklers em funcionamento simultâneo."]
[null,null,null,null,null,null,null,null,"- Um sprinkler em funcionamento simultâneo e um nó."]
[null,null,null,null,null,null,null,null,"- Dois nós."]
[null,null,null,"Imputar a cada troço em análise o nº de sprinklers abastecidos em simultâneo, na coluna correspondente:","2.1","Nº de sprinklers em funcionamento simultâneo por troço","NS sim.troço","nº","- Um nó e a saída da fonte de alimentação (Sistema de Bombagem)."]
[null,null,null,"Imputar a cada troço em análise o nº total de sprinklers abastecidos pelo troço, na coluna correspondente:","2.2","Nº total de sprinklers abastecidos pelo troço","NS troço","nº","Consultar desenho da instalação com os troços devidamente codificados."]
[null,null,null,"Determinar para cada troço o correspondente Caudal Acumulado.","2.3","Caudal Acumulado","Qacumul.","l/min","Caudal total em cada troço, correspondente ao número total de Bocas de Incêndio abastecidas.",{"$f":"IF($H$9=3,\"Imputar a cada troço em análise o número total de Colunas Montante Húmidas Abastecidas.\",\"Imputar a cada troço em análise o número total de Bocas de Incêndio abastecidas, na coluna correspondente ao tipo de B.I. utilizada.\")","v":"Imputar a cada troço em análise o número total de Bocas de Incêndio abastecidas, na coluna correspondente ao tipo de B.I. utilizada."},{"$f":"IF($H$9=3,\"Imputar a cada troço em análise o número total de Colunas Montante Húmidas Abastecidas.\",\"Imputar a cada troço em análise o número total de Bocas de Incêndio abastecidas, na coluna correspondente ao tipo de B.I. utilizada.\")","v":"Imputar a cada troço em análise o número total de Bocas de Incêndio abastecidas, na coluna correspondente ao tipo de B.I. utilizada."},{"$f":"IF($H$9=3,\"Imputar a cada troço em análise o número total de Colunas Montante Húmidas Abastecidas.\",\"Imputar a cada troço em análise o número total de Bocas de Incêndio abastecidas, na coluna correspondente ao tipo de B.I. utilizada.\")","v":"Imputar a cada troço em análise o número total de Bocas de Incêndio abastecidas, na coluna correspondente ao tipo de B.I. utilizada."},{"$f":"IF($H$9=3,\"Imputar a cada troço em análise o número total de Colunas Montante Húmidas Abastecidas.\",\"Imputar a cada troço em análise o número total de Bocas de Incêndio abastecidas, na coluna correspondente ao tipo de B.I. utilizada.\")","v":"Imputar a cada troço em análise o número total de Bocas de Incêndio abastecidas, na coluna correspondente ao tipo de B.I. utilizada."},{"$f":"IF($H$9=3,\"Imputar a cada troço em análise o número total de Colunas Montante Húmidas Abastecidas.\",\"Imputar a cada troço em análise o número total de Bocas de Incêndio abastecidas, na coluna correspondente ao tipo de B.I. utilizada.\")","v":"Imputar a cada troço em análise o número total de Bocas de Incêndio abastecidas, na coluna correspondente ao tipo de B.I. utilizada."}]
[null,null,null,"Determinar para cada troço o correspondente Factor de Simultaneidade.","2.4","Factor de Simultaneidade","FS ",null,"Caudal Máximo em cada troço (correspondente à afectação do coeficiente de simultaneidade)."]
[null,3,null,"Imputar a cada troço da instalação o respectivo comprimento e desnível. Por opção, adicionar ao comprimento do troço de tubo em análise, as perdas de carga referentes aos acessórios utilizados, por consulta do Quadro 2:","3.1","Comprimento do troço","Lreal","m","Consultar desenho da instalação com os troços devidamente codificados."]
[null,null,null,null,"3.2","Desnível do troço","h","m","O desnível \"h\" deverá ser considerado positivo se o troço for ascendente e negativo se o troço for descendente."]
[null,null,null,null,"3.3","Comprimento equivalente local","Leq.local","m",null,null,"Por defeito, é efectuado um acréscimo de 25 % ao comprimento dos troços analisados, para compensação das perdas de carga localizadas."]
[null,null,null,"Determinar o comprimento equivalente de cada troço:","3.4","Comprimento equivalente do troço","Leq","m"]
[null,null,null,"Definir o Caminho Crítico (percurso que corresponde ao maior comprimento de tubagem e maior cota piezométrica);","3.5","Comprimento do Caminho Crítico","Lcrítico","m","Soma dos comprimentos dos diversos troços de tubagem que constituem o caminho crítico."]
[null,null,null,"Determinar o Comprimento Equivalente Máximo de toda a instalação de Média Pressão:","3.6","Comprimento Equivalente do Caminho Crítico","Leq.máx.","m"]
[null,null,null,"Determinar a Perda de Carga Linear Média, a ser utilizada em qualquer troço da tubagem, na determinação do diâmetro interior de cálculo:","3.7","Perda de Carga Linear Média","Jmédia ","m/m"]
[null,6,null,"Determinar, para cada troço, o Diâmetro interior de Cálculo:","3.8","Diâmetro interior de Cálculo","Di cálculo","mm","Consultar Quadro 1."]
[null,4,null,"Dimensionar o troço que contém o sprinkler mais afastado da fonte de alimentação, designado por S1: ","1.9","Caudal mínimo por sprinkler","Qmín.S.","l/min","Pmín.S = Pfc do 1º troço a dimensionar, o qual finaliza no sprinkler (S1) mais afastado da fonte de alimentação."]
[null,null,null,"Atribuir ao sprinkler S1 o caudal e pressão mínimos já calculados, necessários ao correcto desempenho do mesmo:","1.11","Pressão mínima por sprinkler","Pmín.S.","kPa","A pressão final corrigida de um troço (Pfc), acrescenta à (Pf) a perda de carga estática nesse troço, devida ao desnível do mesmo (caso exista)."]
[null,null,null,"Impor a dimensão nominal mínima (DN 25), aplicável a uma instalação do tipo extinção automática (ver Quadro 5):","5.5","Dimensão Nominal","DN",null,"Consultar Quadro 5."]
[null,null,null,"Fixar o correspondente diâmetro interior normalizado da tubagem de aço, em conformidade com a norma europeia EN 10255 (Série Média) ou equivalente:","5.2","Diâmetro interior normalizado","Di","mm","Consultar Quadro 1."]
[null,null,null,"Calcular a perda de carga unitária (J) deste troço:","7.1","Perda de carga unitária","J","kPa/m"]
[null,null,null,"Calcular a perda de carga dinâmica (DP) deste troço.:","7.2","Perda de carga dinâmica no troço","ΔP","kPa"]
[null,null,null,"Calcular a pressão inicial (Pi) deste troço:","6.1","Pressão inicial no troço","Pi","kPa"]
[null,5,null,"Para cada troço em análise, impor a dimensão nominal mínima aplicável a uma instalação do tipo extinção automática, em função do nº total de sprinklers abastecidos (ver Quadro 5):","2.2","Nº total de sprinklers abastecidos pelo troço","NS troço","nº","Consultar desenho da instalação com os troços devidamente codificados."]
[null,null,null,null,"5.5","Dimensão Nominal","DN","mm","Consultar Quadro 5."]
[null,null,null,"Fixar o correspondente diâmetro interior normalizado da tubagem de aço, em conformidade com a norma europeia EN 10255 (Série Média) ou equivalente. Assim como, as correspondentes designações normalizadas do tubo de aço:","5.2","Diâmetro interior normalizado","Di","mm","Consultar Quadro 1."]
[null,null,null,null,"5.3","Diâmetro exterior","D","mm","Adicionalmente, as correspondentes dimensões da ligação roscada (R). "]
[null,6,null,"Tendo-se iniciado a análise pelo troço da instalação que contém o sprinkler S1 considerado na posição mais desfavorável, percorrer a instalação de forma sequêncial e do fim para o início, para o cálculo das pressões instaladas em cada troço: ","6.1","Pressão inicial no troço","Pi","kPa","A relação entre as pressões inicial (Pi) e final (Pf) de um determinado troço, são estabelecidas através do cálculo da perda de carga linear unitária pela fórmula de Hazen & Williams (ou Flamant). E tendo em consideração a  respectiva perda de carga estática (caso exista). "]
[null,null,null,"a) A pressão final (Pf) de um qualquer troço, deverá ser a Pressão Inicial (Pi) do(s) troço(s) situado(s) a jusante."]
[null,null,null,"b) A pressão inicial (Pi) de um qualquer troço, deverá ser a pressão final (Pf) de um troço situado a montante.","6.2","Pressão final no troço","Pf","kPa"]
[null,null,null,"c) Relacionar Pi com Pf através das Fórmulas de Flamant ou Hazen & Williams, ao critério do projectista. E tendo em consideração a  respectiva perda de carga estática (caso exista). ",null,null,null,null,"A pressão final de um troço (Pf),  traduz a perda de carga dinâmica nesse troço, acrescida da respectiva perda de carga estática devida ao desnível do mesmo (caso exista)."]
[null,7,null,"Para cada troço em análise, determinar o respectivo caudal de cálculo do seguinte modo:","1.9","Caudal mínimo por sprinkler","Qmín.S","l/min","Pmín.S = Pf  do 1º troço a dimensionar, o qual finaliza no sprinkler (S1) mais afastado da fonte de alimentação."]
[null,null,null,"a) Se o troço em análise finaliza num sprinkler e:","1.11","Pressão mínima por sprinkler","Pmín.S","kPa","Designa-se por sub-ramal 1, o sub-ramal em funcionamento simultâneo que contém o sprinkler (S1) mais afastado da fonte de alimentação."]
[null,null,null,"a1) a jusante não existe qualquer outro sprinkler de funcionamento simultãneo, adoptar: Qtroço = Qmín.S.","1.10","Coeficiente de caudal do sprinkler","K (métrico)","l/min.bar0,5"]
[null,null,null,"a2) a jusante existe outro sprinkler de funcionamento simultãneo, adoptar para efeitos de cálculo o seguinte caudal: Qtroço = QS + Qacum. a jusante , onde QS =K.(Pfc / 100)1/2.","4.1","Coeficiente de caudal do sub-ramal 1","Ksub-ramal1","l/min.bar0,5"]
[null,null,null,null,"4.2","Caudal de serviço do sprinkler","QS","l/min"]
[null,null,null,"b) Se o troço em análise finaliza num sub-ramal de  funcionamento simultâneo, adoptar para efeitos de cálculo:   Qtroço = Qsub-ramal + Qacum. a jusante e Qsub-ramal = Ksub-ramal1.(Pfc / 100)1/2  e Ksub-ramal1 = Qsub-ramal1/(Pi sub-ramal1/ 100)1/2. ",null,"Caudal de serviço do sub-ramal","Qsub-ramal","l/min"]
[null,null,null,null,null,"Caudal de serviço do sub-ramal 1","Qsub-ramal1","l/min"]
[null,null,null,null,"4.3","Caudal de cálculo","Qtroço","l/min"]
[null,null,null,"c) Ou então: Qtroço = Qacum. a jusante. ",null,"Caudal acumulado a jusante","Qacum. a jusante","l/min","Caudal a ser incorporado na determinação do caudal de cálculo."]
[null,null,null,"Calcular a perda de carga unitária ( J ) de cada troço:","7.1","Perda de carga unitária","J","kPa/m"]
[null,null,null,"Calcular a perda de carga dinâmica ( ΔPdinâm. ) de cada troço:","7.2","Perda de carga dinâmica no troço","ΔPdinâm.","kPa"]
[null,null,null,"Calcular a perda de carga estática ( ΔPestática ) de cada troço:","7.3","Perda de carga estática no troço","ΔPestática","kPa"]
[null,null,null,"Calcular a perda de carga total ( ΔPtroço ) de cada troço:","7.4","Perda de carga total no troço","ΔPtroço","kPa"]
[null,8,null,"Calcular a perda de carga dinâmica acumulada (ΔPacum.R.P.) nos ramais principais:","8.1","Perda de carga acumulada no troço","ΔPacum.R.P.","kPa"]
[null,null,null,"Fixar a perda de carga acumulada admissível (ΔPadm.R.P.):","8.3","Perda de carga admissível","ΔPadm.R.P.","kPa","Usualmente limitada a 50 kPa, em conformidade com EN 12845 (Secção 13.3.4.3)."]
[null,9,null,"Calcular a velocidade de escoamento em cada troço:","9.1","Velocidade de escoamento no troço","V ","m/s"]
[null,10,null,{"$f":"IF($H$9=1,\"O dimensionamento está concluído se os ramais principais cumprirem com os limites de perda de carga dinâmica e velocidade de escoamento aplicáveis.\",IF($H$9=2,\"O dimensionamento está concluído se os ramais principais cumprirem com os limites de perda de carga dinâmica e velocidade de escoamento aplicáveis e a instalação cumprir com as necessidades de pressão e caudal aplicáveis (ver Quadro 6).\",\"\"))","v":"O dimensionamento está concluído se os ramais principais cumprirem com os limites de perda de carga dinâmica e velocidade de escoamento aplicáveis."},null,null,null,null,"Se tal não suceder, subir um escalão no valor do diâmetro interior normalizado desse troço e regressar à fase 6."]
[null,11,null,"Avaliar, se aplicável, o impacto da tubagem de aspiração na necessidade de pressão  (Pi máx.):",null,"Perda de carga total na aspiração","ΔPtotal-asp.","kPa","Determinada através do comprimento da tubagem de aspiração, comprimento local equivalente e altura de aspiração."]
[null,12,null,"Calcular a Necessidade de Pressão-Abastecimento ( Pi máx.):","10.1","Necessidade de pressão","Pi máx.","kPa"]
[null,null,null,"Calcular a Necessidade de Caudal-Abastecimento ( Q máx.):","10.2","Necessidade de caudal","Qmáx.","l/min"]
[null,null,null,"Calcular, se aplicável, a potência mínima da fonte de pressão, o NPSH admissivel e a capacidade do reservatório:","10.4","Potência mínima","Pot.mín.","kW ou CV"]
[null,13,null,"Subir um escalão no valor do diâmetro interior do tubo de aço.","5.1","Diâmetro interior imposto","Di imposto","mm","Consultar Quadro 1, caso seja necessário redimensionar."]
[null,null,null,"Referências Bibliográficas: Lei n.º 123/2019 de 18 Out., Port.ª n.º 135/2020 de 2 Jun. que actualiza a Port.ª n.º 1532/2008 de 29 Dez., NFPA 13, N.T. n.º 16 ANEPC, Livro LNEC ISBN 972-49-1849-1 e Manual do Instalador APTA."]

{"sheet":"Conversões","index":10,"n_rows":29,"n_cols":10,"rows_kept":29,"cut":false,"hidden":false,"merged":[]}
[]
[]
[]
[]
[]
[]
[]
[]
[]
[]
[]
[]
[]
[]
[]
[]
[]
[]
[]
[]
[]
[]
[]
[null,null,null,null,"-",{"$f":"IF($B24=\"\",\"\",$B24*0.01)","v":""},{"$f":"IF($B24=\"\",\"\",$B24*0.0102)","v":""},{"$f":"IF($B24=\"\",\"\",$B24*0.102)","v":""},{"$f":"IF($B24=\"\",\"\",$B24*0.0987)","v":""},{"$f":"IF($B24=\"\",\"\",$B24*0.145)","v":""}]
[null,null,null,null,{"$f":"IF($B25=\"\",\"\",$B25*100)","v":""},"-",{"$f":"IF($B25=\"\",\"\",$B25*1.0197)","v":""},{"$f":"IF($B25=\"\",\"\",$B25*10.197)","v":""},{"$f":"IF($B25=\"\",\"\",$B25*0.987)","v":""},{"$f":"IF($B25=\"\",\"\",$B25*14.505)","v":""}]
[null,null,null,null,{"$f":"IF($B26=\"\",\"\",$B26*98.1)","v":""},{"$f":"IF($B26=\"\",\"\",$B26*0.9807)","v":""},"-",{"$f":"IF($B26=\"\",\"\",$B26*10)","v":""},{"$f":"IF($B26=\"\",\"\",$B26*0.968)","v":""},{"$f":"IF($B26=\"\",\"\",$B26*14.22)","v":""}]
[null,null,null,null,{"$f":"IF($B27=\"\",\"\",$B27*9.81)","v":""},{"$f":"IF($B27=\"\",\"\",$B27*0.09807)","v":""},{"$f":"IF($B27=\"\",\"\",$B27*0.1)","v":""},"-",{"$f":"IF($B27=\"\",\"\",$B27*0.09687)","v":""},{"$f":"IF($B27=\"\",\"\",$B27*1.4225)","v":""}]
[null,null,null,null,{"$f":"IF($B28=\"\",\"\",$B28*101.3)","v":""},{"$f":"IF($B28=\"\",\"\",$B28*1.013)","v":""},{"$f":"IF($B28=\"\",\"\",$B28*1.033)","v":""},{"$f":"IF($B28=\"\",\"\",$B28*10.33)","v":""},"-",{"$f":"IF($B28=\"\",\"\",$B28*14.652)","v":""}]
[null,null,null,null,{"$f":"IF($B29=\"\",\"\",$B29*6.895)","v":""},{"$f":"IF($B29=\"\",\"\",$B29*0.06805)","v":""},{"$f":"IF($B29=\"\",\"\",$B29*0.0703)","v":""},{"$f":"IF($B29=\"\",\"\",$B29*0.703)","v":""},{"$f":"IF($B29=\"\",\"\",$B29*0.06894)","v":""},"-"]